Mock Version: 5.5 Mock Version: 5.5 Mock Version: 5.5 ENTER ['do_with_status'](['bash', '--login', '-c', '/usr/bin/rpmbuild -bs --noclean --target noarch --nodeps /builddir/build/SPECS/python-pypandoc.spec'], chrootPath='/var/lib/mock/f40-build-2697306-69921/root'env={'TERM': 'vt100', 'SHELL': '/bin/bash', 'HOME': '/builddir', 'HOSTNAME': 'mock', 'PATH': '/usr/bin:/bin:/usr/sbin:/sbin', 'PROMPT_COMMAND': 'printf "\\033]0;\\007"', 'PS1': ' \\s-\\v\\$ ', 'LANG': 'C.UTF-8'}shell=Falselogger=timeout=864000uid=997gid=135user='mockbuild'nspawn_args=['--capability=cap_ipc_lock', '--bind=/tmp/mock-resolv.3mlpk7kg:/etc/resolv.conf', '--bind=/dev/btrfs-control', '--bind=/dev/mapper/control', '--bind=/dev/fuse', '--bind=/dev/loop-control', '--bind=/dev/loop0', '--bind=/dev/loop1', '--bind=/dev/loop2', '--bind=/dev/loop3', '--bind=/dev/loop4', '--bind=/dev/loop5', '--bind=/dev/loop6', '--bind=/dev/loop7', '--bind=/dev/loop8', '--bind=/dev/loop9', '--bind=/dev/loop10', '--bind=/dev/loop11']unshare_net=TrueprintOutput=False) Using nspawn with args ['--capability=cap_ipc_lock', '--bind=/tmp/mock-resolv.3mlpk7kg:/etc/resolv.conf', '--bind=/dev/btrfs-control', '--bind=/dev/mapper/control', '--bind=/dev/fuse', '--bind=/dev/loop-control', '--bind=/dev/loop0', '--bind=/dev/loop1', '--bind=/dev/loop2', '--bind=/dev/loop3', '--bind=/dev/loop4', '--bind=/dev/loop5', '--bind=/dev/loop6', '--bind=/dev/loop7', '--bind=/dev/loop8', '--bind=/dev/loop9', '--bind=/dev/loop10', '--bind=/dev/loop11'] Executing command: ['/usr/bin/systemd-nspawn', '-q', '-M', '7ca0246b028e4a7ebdd48828d6b0b988', '-D', '/var/lib/mock/f40-build-2697306-69921/root', '-a', '-u', 'mockbuild', '--capability=cap_ipc_lock', '--bind=/tmp/mock-resolv.3mlpk7kg:/etc/resolv.conf', '--bind=/dev/btrfs-control', '--bind=/dev/mapper/control', '--bind=/dev/fuse', '--bind=/dev/loop-control', '--bind=/dev/loop0', '--bind=/dev/loop1', '--bind=/dev/loop2', '--bind=/dev/loop3', '--bind=/dev/loop4', '--bind=/dev/loop5', '--bind=/dev/loop6', '--bind=/dev/loop7', '--bind=/dev/loop8', '--bind=/dev/loop9', '--bind=/dev/loop10', '--bind=/dev/loop11', '--console=pipe', '--setenv=TERM=vt100', '--setenv=SHELL=/bin/bash', '--setenv=HOME=/builddir', '--setenv=HOSTNAME=mock', '--setenv=PATH=/usr/bin:/bin:/usr/sbin:/sbin', '--setenv=PROMPT_COMMAND=printf "\\033]0;\\007"', '--setenv=PS1= \\s-\\v\\$ ', '--setenv=LANG=C.UTF-8', '--resolv-conf=off', 'bash', '--login', '-c', '/usr/bin/rpmbuild -bs --noclean --target noarch --nodeps /builddir/build/SPECS/python-pypandoc.spec'] with env {'TERM': 'vt100', 'SHELL': '/bin/bash', 'HOME': '/builddir', 'HOSTNAME': 'mock', 'PATH': '/usr/bin:/bin:/usr/sbin:/sbin', 'PROMPT_COMMAND': 'printf "\\033]0;\\007"', 'PS1': ' \\s-\\v\\$ ', 'LANG': 'C.UTF-8', 'SYSTEMD_NSPAWN_TMPFS_TMP': '0', 'SYSTEMD_SECCOMP': '0'} and shell False Building target platforms: noarch Building for target noarch setting SOURCE_DATE_EPOCH=1712188800 Wrote: /builddir/build/SRPMS/python-pypandoc-1.13-3.fc40.src.rpm Child return code was: 0 ENTER ['do_with_status'](['bash', '--login', '-c', '/usr/bin/rpmbuild -br --noclean --target noarch --nodeps /builddir/build/SPECS/python-pypandoc.spec'], chrootPath='/var/lib/mock/f40-build-2697306-69921/root'env={'TERM': 'vt100', 'SHELL': '/bin/bash', 'HOME': '/builddir', 'HOSTNAME': 'mock', 'PATH': '/usr/bin:/bin:/usr/sbin:/sbin', 'PROMPT_COMMAND': 'printf "\\033]0;\\007"', 'PS1': ' \\s-\\v\\$ ', 'LANG': 'C.UTF-8'}shell=Falselogger=timeout=864000uid=997gid=135user='mockbuild'nspawn_args=['--capability=cap_ipc_lock', '--bind=/tmp/mock-resolv.3mlpk7kg:/etc/resolv.conf', '--bind=/dev/btrfs-control', '--bind=/dev/mapper/control', '--bind=/dev/fuse', '--bind=/dev/loop-control', '--bind=/dev/loop0', '--bind=/dev/loop1', '--bind=/dev/loop2', '--bind=/dev/loop3', '--bind=/dev/loop4', '--bind=/dev/loop5', '--bind=/dev/loop6', '--bind=/dev/loop7', '--bind=/dev/loop8', '--bind=/dev/loop9', '--bind=/dev/loop10', '--bind=/dev/loop11']unshare_net=TrueraiseExc=FalseprintOutput=False) Using nspawn with args ['--capability=cap_ipc_lock', '--bind=/tmp/mock-resolv.3mlpk7kg:/etc/resolv.conf', '--bind=/dev/btrfs-control', '--bind=/dev/mapper/control', '--bind=/dev/fuse', '--bind=/dev/loop-control', '--bind=/dev/loop0', '--bind=/dev/loop1', '--bind=/dev/loop2', '--bind=/dev/loop3', '--bind=/dev/loop4', '--bind=/dev/loop5', '--bind=/dev/loop6', '--bind=/dev/loop7', '--bind=/dev/loop8', '--bind=/dev/loop9', '--bind=/dev/loop10', '--bind=/dev/loop11'] Executing command: ['/usr/bin/systemd-nspawn', '-q', '-M', '7a68b582ce924147b0a97102b2e6b989', '-D', '/var/lib/mock/f40-build-2697306-69921/root', '-a', '-u', 'mockbuild', '--capability=cap_ipc_lock', '--bind=/tmp/mock-resolv.3mlpk7kg:/etc/resolv.conf', '--bind=/dev/btrfs-control', '--bind=/dev/mapper/control', '--bind=/dev/fuse', '--bind=/dev/loop-control', '--bind=/dev/loop0', '--bind=/dev/loop1', '--bind=/dev/loop2', '--bind=/dev/loop3', '--bind=/dev/loop4', '--bind=/dev/loop5', '--bind=/dev/loop6', '--bind=/dev/loop7', '--bind=/dev/loop8', '--bind=/dev/loop9', '--bind=/dev/loop10', '--bind=/dev/loop11', '--console=pipe', '--setenv=TERM=vt100', '--setenv=SHELL=/bin/bash', '--setenv=HOME=/builddir', '--setenv=HOSTNAME=mock', '--setenv=PATH=/usr/bin:/bin:/usr/sbin:/sbin', '--setenv=PROMPT_COMMAND=printf "\\033]0;\\007"', '--setenv=PS1= \\s-\\v\\$ ', '--setenv=LANG=C.UTF-8', '--resolv-conf=off', 'bash', '--login', '-c', '/usr/bin/rpmbuild -br --noclean --target noarch --nodeps /builddir/build/SPECS/python-pypandoc.spec'] with env {'TERM': 'vt100', 'SHELL': '/bin/bash', 'HOME': '/builddir', 'HOSTNAME': 'mock', 'PATH': '/usr/bin:/bin:/usr/sbin:/sbin', 'PROMPT_COMMAND': 'printf "\\033]0;\\007"', 'PS1': ' \\s-\\v\\$ ', 'LANG': 'C.UTF-8', 'SYSTEMD_NSPAWN_TMPFS_TMP': '0', 'SYSTEMD_SECCOMP': '0'} and shell False Building target platforms: noarch Building for target noarch setting SOURCE_DATE_EPOCH=1712188800 Executing(%prep): /bin/sh -e /var/tmp/rpm-tmp.UzcpFD + umask 022 + cd /builddir/build/BUILD + cd /builddir/build/BUILD + rm -rf pypandoc-1.13 + /usr/lib/rpm/rpmuncompress -x /builddir/build/SOURCES/python-pypandoc-1.13.tar.gz + STATUS=0 + '[' 0 -ne 0 ']' + cd pypandoc-1.13 + rm -rf /builddir/build/BUILD/pypandoc-1.13-SPECPARTS + /usr/bin/mkdir -p /builddir/build/BUILD/pypandoc-1.13-SPECPARTS + /usr/bin/chmod -Rf a+rX,u+w,g-w,o-w . + RPM_EC=0 ++ jobs -p + exit 0 Executing(%generate_buildrequires): /bin/sh -e /var/tmp/rpm-tmp.2YIKXB + umask 022 + cd /builddir/build/BUILD + cd pypandoc-1.13 + CFLAGS='-O2 -fexceptions -g -grecord-gcc-switches -pipe -Wall -Werror=format-security -Werror=implicit-function-declaration -Werror=implicit-int -Wp,-U_FORTIFY_SOURCE,-D_FORTIFY_SOURCE=3 -Wp,-D_GLIBCXX_ASSERTIONS -specs=/usr/lib/rpm/redhat/redhat-hardened-cc1 -fstack-protector-strong -specs=/usr/lib/rpm/redhat/redhat-annobin-cc1 -fasynchronous-unwind-tables -fno-omit-frame-pointer ' + export CFLAGS + CXXFLAGS='-O2 -fexceptions -g -grecord-gcc-switches -pipe -Wall -Werror=format-security -Wp,-U_FORTIFY_SOURCE,-D_FORTIFY_SOURCE=3 -Wp,-D_GLIBCXX_ASSERTIONS -specs=/usr/lib/rpm/redhat/redhat-hardened-cc1 -fstack-protector-strong -specs=/usr/lib/rpm/redhat/redhat-annobin-cc1 -fasynchronous-unwind-tables -fno-omit-frame-pointer ' + export CXXFLAGS + FFLAGS='-O2 -fexceptions -g -grecord-gcc-switches -pipe -Wall -Wp,-U_FORTIFY_SOURCE,-D_FORTIFY_SOURCE=3 -Wp,-D_GLIBCXX_ASSERTIONS -specs=/usr/lib/rpm/redhat/redhat-hardened-cc1 -fstack-protector-strong -specs=/usr/lib/rpm/redhat/redhat-annobin-cc1 -fasynchronous-unwind-tables -fno-omit-frame-pointer -I/usr/lib/gfortran/modules ' + export FFLAGS + FCFLAGS='-O2 -fexceptions -g -grecord-gcc-switches -pipe -Wall -Wp,-U_FORTIFY_SOURCE,-D_FORTIFY_SOURCE=3 -Wp,-D_GLIBCXX_ASSERTIONS -specs=/usr/lib/rpm/redhat/redhat-hardened-cc1 -fstack-protector-strong -specs=/usr/lib/rpm/redhat/redhat-annobin-cc1 -fasynchronous-unwind-tables -fno-omit-frame-pointer -I/usr/lib/gfortran/modules ' + export FCFLAGS + VALAFLAGS=-g + export VALAFLAGS + RUSTFLAGS='-Copt-level=3 -Cdebuginfo=2 -Ccodegen-units=1 -Cstrip=none -Cforce-frame-pointers=yes --cap-lints=warn' + export RUSTFLAGS + LDFLAGS='-Wl,-z,relro -Wl,--as-needed -Wl,-z,now -specs=/usr/lib/rpm/redhat/redhat-hardened-ld -specs=/usr/lib/rpm/redhat/redhat-annobin-cc1 -Wl,--build-id=sha1 ' + export LDFLAGS + LT_SYS_LIBRARY_PATH=/usr/lib: + export LT_SYS_LIBRARY_PATH + CC=gcc + export CC + CXX=g++ + export CXX + echo pyproject-rpm-macros + echo python3-devel + echo 'python3dist(pip) >= 19' + echo 'python3dist(packaging)' + '[' -f pyproject.toml ']' + echo '(python3dist(tomli) if python3-devel < 3.11)' + rm -rfv '*.dist-info/' + '[' -f /usr/bin/python3 ']' + mkdir -p /builddir/build/BUILD/pypandoc-1.13/.pyproject-builddir + echo -n + CFLAGS='-O2 -fexceptions -g -grecord-gcc-switches -pipe -Wall -Werror=format-security -Werror=implicit-function-declaration -Werror=implicit-int -Wp,-U_FORTIFY_SOURCE,-D_FORTIFY_SOURCE=3 -Wp,-D_GLIBCXX_ASSERTIONS -specs=/usr/lib/rpm/redhat/redhat-hardened-cc1 -fstack-protector-strong -specs=/usr/lib/rpm/redhat/redhat-annobin-cc1 -fasynchronous-unwind-tables -fno-omit-frame-pointer ' + LDFLAGS='-Wl,-z,relro -Wl,--as-needed -Wl,-z,now -specs=/usr/lib/rpm/redhat/redhat-hardened-ld -specs=/usr/lib/rpm/redhat/redhat-annobin-cc1 -Wl,--build-id=sha1 ' + TMPDIR=/builddir/build/BUILD/pypandoc-1.13/.pyproject-builddir + RPM_TOXENV=py312 + HOSTNAME=rpmbuild + /usr/bin/python3 -Bs /usr/lib/rpm/redhat/pyproject_buildrequires.py --generate-extras --python3_pkgversion 3 --wheeldir /builddir/build/BUILD/pypandoc-1.13/pyproject-wheeldir --output /builddir/build/BUILD/python-pypandoc-1.13-3.fc40.noarch-pyproject-buildrequires Handling poetry-core>=1.0.0 from build-system.requires Requirement not satisfied: poetry-core>=1.0.0 Exiting dependency generation pass: build backend + cat /builddir/build/BUILD/python-pypandoc-1.13-3.fc40.noarch-pyproject-buildrequires + rm -rfv '*.dist-info/' + RPM_EC=0 ++ jobs -p + exit 0 Wrote: /builddir/build/SRPMS/python-pypandoc-1.13-3.fc40.buildreqs.nosrc.rpm Child return code was: 11 Dynamic buildrequires detected Going to install missing buildrequires. See root.log for details. ENTER ['do_with_status'](['bash', '--login', '-c', '/usr/bin/rpmbuild -br --noprep --noclean --target noarch --nodeps /builddir/build/SPECS/python-pypandoc.spec'], chrootPath='/var/lib/mock/f40-build-2697306-69921/root'env={'TERM': 'vt100', 'SHELL': '/bin/bash', 'HOME': '/builddir', 'HOSTNAME': 'mock', 'PATH': '/usr/bin:/bin:/usr/sbin:/sbin', 'PROMPT_COMMAND': 'printf "\\033]0;\\007"', 'PS1': ' \\s-\\v\\$ ', 'LANG': 'C.UTF-8'}shell=Falselogger=timeout=864000uid=997gid=135user='mockbuild'nspawn_args=['--capability=cap_ipc_lock', '--bind=/tmp/mock-resolv.3mlpk7kg:/etc/resolv.conf', '--bind=/dev/btrfs-control', '--bind=/dev/mapper/control', '--bind=/dev/fuse', '--bind=/dev/loop-control', '--bind=/dev/loop0', '--bind=/dev/loop1', '--bind=/dev/loop2', '--bind=/dev/loop3', '--bind=/dev/loop4', '--bind=/dev/loop5', '--bind=/dev/loop6', '--bind=/dev/loop7', '--bind=/dev/loop8', '--bind=/dev/loop9', '--bind=/dev/loop10', '--bind=/dev/loop11']unshare_net=TrueraiseExc=FalseprintOutput=False) Using nspawn with args ['--capability=cap_ipc_lock', '--bind=/tmp/mock-resolv.3mlpk7kg:/etc/resolv.conf', '--bind=/dev/btrfs-control', '--bind=/dev/mapper/control', '--bind=/dev/fuse', '--bind=/dev/loop-control', '--bind=/dev/loop0', '--bind=/dev/loop1', '--bind=/dev/loop2', '--bind=/dev/loop3', '--bind=/dev/loop4', '--bind=/dev/loop5', '--bind=/dev/loop6', '--bind=/dev/loop7', '--bind=/dev/loop8', '--bind=/dev/loop9', '--bind=/dev/loop10', '--bind=/dev/loop11'] Executing command: ['/usr/bin/systemd-nspawn', '-q', '-M', '351b38456bcc40b1b15b9cf70a7bee59', '-D', '/var/lib/mock/f40-build-2697306-69921/root', '-a', '-u', 'mockbuild', '--capability=cap_ipc_lock', '--bind=/tmp/mock-resolv.3mlpk7kg:/etc/resolv.conf', '--bind=/dev/btrfs-control', '--bind=/dev/mapper/control', '--bind=/dev/fuse', '--bind=/dev/loop-control', '--bind=/dev/loop0', '--bind=/dev/loop1', '--bind=/dev/loop2', '--bind=/dev/loop3', '--bind=/dev/loop4', '--bind=/dev/loop5', '--bind=/dev/loop6', '--bind=/dev/loop7', '--bind=/dev/loop8', '--bind=/dev/loop9', '--bind=/dev/loop10', '--bind=/dev/loop11', '--console=pipe', '--setenv=TERM=vt100', '--setenv=SHELL=/bin/bash', '--setenv=HOME=/builddir', '--setenv=HOSTNAME=mock', '--setenv=PATH=/usr/bin:/bin:/usr/sbin:/sbin', '--setenv=PROMPT_COMMAND=printf "\\033]0;\\007"', '--setenv=PS1= \\s-\\v\\$ ', '--setenv=LANG=C.UTF-8', '--resolv-conf=off', 'bash', '--login', '-c', '/usr/bin/rpmbuild -br --noprep --noclean --target noarch --nodeps /builddir/build/SPECS/python-pypandoc.spec'] with env {'TERM': 'vt100', 'SHELL': '/bin/bash', 'HOME': '/builddir', 'HOSTNAME': 'mock', 'PATH': '/usr/bin:/bin:/usr/sbin:/sbin', 'PROMPT_COMMAND': 'printf "\\033]0;\\007"', 'PS1': ' \\s-\\v\\$ ', 'LANG': 'C.UTF-8', 'SYSTEMD_NSPAWN_TMPFS_TMP': '0', 'SYSTEMD_SECCOMP': '0'} and shell False Building target platforms: noarch Building for target noarch setting SOURCE_DATE_EPOCH=1712188800 Executing(%generate_buildrequires): /bin/sh -e /var/tmp/rpm-tmp.EAN6ev + umask 022 + cd /builddir/build/BUILD + cd pypandoc-1.13 + CFLAGS='-O2 -fexceptions -g -grecord-gcc-switches -pipe -Wall -Werror=format-security -Werror=implicit-function-declaration -Werror=implicit-int -Wp,-U_FORTIFY_SOURCE,-D_FORTIFY_SOURCE=3 -Wp,-D_GLIBCXX_ASSERTIONS -specs=/usr/lib/rpm/redhat/redhat-hardened-cc1 -fstack-protector-strong -specs=/usr/lib/rpm/redhat/redhat-annobin-cc1 -fasynchronous-unwind-tables -fno-omit-frame-pointer ' + export CFLAGS + CXXFLAGS='-O2 -fexceptions -g -grecord-gcc-switches -pipe -Wall -Werror=format-security -Wp,-U_FORTIFY_SOURCE,-D_FORTIFY_SOURCE=3 -Wp,-D_GLIBCXX_ASSERTIONS -specs=/usr/lib/rpm/redhat/redhat-hardened-cc1 -fstack-protector-strong -specs=/usr/lib/rpm/redhat/redhat-annobin-cc1 -fasynchronous-unwind-tables -fno-omit-frame-pointer ' + export CXXFLAGS + FFLAGS='-O2 -fexceptions -g -grecord-gcc-switches -pipe -Wall -Wp,-U_FORTIFY_SOURCE,-D_FORTIFY_SOURCE=3 -Wp,-D_GLIBCXX_ASSERTIONS -specs=/usr/lib/rpm/redhat/redhat-hardened-cc1 -fstack-protector-strong -specs=/usr/lib/rpm/redhat/redhat-annobin-cc1 -fasynchronous-unwind-tables -fno-omit-frame-pointer -I/usr/lib/gfortran/modules ' + export FFLAGS + FCFLAGS='-O2 -fexceptions -g -grecord-gcc-switches -pipe -Wall -Wp,-U_FORTIFY_SOURCE,-D_FORTIFY_SOURCE=3 -Wp,-D_GLIBCXX_ASSERTIONS -specs=/usr/lib/rpm/redhat/redhat-hardened-cc1 -fstack-protector-strong -specs=/usr/lib/rpm/redhat/redhat-annobin-cc1 -fasynchronous-unwind-tables -fno-omit-frame-pointer -I/usr/lib/gfortran/modules ' + export FCFLAGS + VALAFLAGS=-g + export VALAFLAGS + RUSTFLAGS='-Copt-level=3 -Cdebuginfo=2 -Ccodegen-units=1 -Cstrip=none -Cforce-frame-pointers=yes --cap-lints=warn' + export RUSTFLAGS + LDFLAGS='-Wl,-z,relro -Wl,--as-needed -Wl,-z,now -specs=/usr/lib/rpm/redhat/redhat-hardened-ld -specs=/usr/lib/rpm/redhat/redhat-annobin-cc1 -Wl,--build-id=sha1 ' + export LDFLAGS + LT_SYS_LIBRARY_PATH=/usr/lib: + export LT_SYS_LIBRARY_PATH + CC=gcc + export CC + CXX=g++ + export CXX + echo pyproject-rpm-macros + echo python3-devel + echo 'python3dist(pip) >= 19' + echo 'python3dist(packaging)' + '[' -f pyproject.toml ']' + echo '(python3dist(tomli) if python3-devel < 3.11)' + rm -rfv '*.dist-info/' + '[' -f /usr/bin/python3 ']' + mkdir -p /builddir/build/BUILD/pypandoc-1.13/.pyproject-builddir + echo -n + CFLAGS='-O2 -fexceptions -g -grecord-gcc-switches -pipe -Wall -Werror=format-security -Werror=implicit-function-declaration -Werror=implicit-int -Wp,-U_FORTIFY_SOURCE,-D_FORTIFY_SOURCE=3 -Wp,-D_GLIBCXX_ASSERTIONS -specs=/usr/lib/rpm/redhat/redhat-hardened-cc1 -fstack-protector-strong -specs=/usr/lib/rpm/redhat/redhat-annobin-cc1 -fasynchronous-unwind-tables -fno-omit-frame-pointer ' + LDFLAGS='-Wl,-z,relro -Wl,--as-needed -Wl,-z,now -specs=/usr/lib/rpm/redhat/redhat-hardened-ld -specs=/usr/lib/rpm/redhat/redhat-annobin-cc1 -Wl,--build-id=sha1 ' + TMPDIR=/builddir/build/BUILD/pypandoc-1.13/.pyproject-builddir + RPM_TOXENV=py312 + HOSTNAME=rpmbuild + /usr/bin/python3 -Bs /usr/lib/rpm/redhat/pyproject_buildrequires.py --generate-extras --python3_pkgversion 3 --wheeldir /builddir/build/BUILD/pypandoc-1.13/pyproject-wheeldir --output /builddir/build/BUILD/python-pypandoc-1.13-3.fc40.noarch-pyproject-buildrequires Handling poetry-core>=1.0.0 from build-system.requires Requirement satisfied: poetry-core>=1.0.0 (installed: poetry-core 1.8.1) + cat /builddir/build/BUILD/python-pypandoc-1.13-3.fc40.noarch-pyproject-buildrequires + rm -rfv pypandoc-1.13.dist-info/ removed 'pypandoc-1.13.dist-info/WHEEL' removed 'pypandoc-1.13.dist-info/LICENSE' removed 'pypandoc-1.13.dist-info/METADATA' removed directory 'pypandoc-1.13.dist-info/' + RPM_EC=0 ++ jobs -p + exit 0 Wrote: /builddir/build/SRPMS/python-pypandoc-1.13-3.fc40.buildreqs.nosrc.rpm Child return code was: 11 Dynamic buildrequires detected Going to install missing buildrequires. See root.log for details. ENTER ['do_with_status'](['bash', '--login', '-c', '/usr/bin/rpmbuild -ba --noprep --noclean --target noarch --nodeps /builddir/build/SPECS/python-pypandoc.spec'], chrootPath='/var/lib/mock/f40-build-2697306-69921/root'env={'TERM': 'vt100', 'SHELL': '/bin/bash', 'HOME': '/builddir', 'HOSTNAME': 'mock', 'PATH': '/usr/bin:/bin:/usr/sbin:/sbin', 'PROMPT_COMMAND': 'printf "\\033]0;\\007"', 'PS1': ' \\s-\\v\\$ ', 'LANG': 'C.UTF-8'}shell=Falselogger=timeout=864000uid=997gid=135user='mockbuild'nspawn_args=['--capability=cap_ipc_lock', '--bind=/tmp/mock-resolv.3mlpk7kg:/etc/resolv.conf', '--bind=/dev/btrfs-control', '--bind=/dev/mapper/control', '--bind=/dev/fuse', '--bind=/dev/loop-control', '--bind=/dev/loop0', '--bind=/dev/loop1', '--bind=/dev/loop2', '--bind=/dev/loop3', '--bind=/dev/loop4', '--bind=/dev/loop5', '--bind=/dev/loop6', '--bind=/dev/loop7', '--bind=/dev/loop8', '--bind=/dev/loop9', '--bind=/dev/loop10', '--bind=/dev/loop11']unshare_net=TrueprintOutput=False) Using nspawn with args ['--capability=cap_ipc_lock', '--bind=/tmp/mock-resolv.3mlpk7kg:/etc/resolv.conf', '--bind=/dev/btrfs-control', '--bind=/dev/mapper/control', '--bind=/dev/fuse', '--bind=/dev/loop-control', '--bind=/dev/loop0', '--bind=/dev/loop1', '--bind=/dev/loop2', '--bind=/dev/loop3', '--bind=/dev/loop4', '--bind=/dev/loop5', '--bind=/dev/loop6', '--bind=/dev/loop7', '--bind=/dev/loop8', '--bind=/dev/loop9', '--bind=/dev/loop10', '--bind=/dev/loop11'] Executing command: ['/usr/bin/systemd-nspawn', '-q', '-M', '23881c087e044d67baac6f4acdb8e7ac', '-D', '/var/lib/mock/f40-build-2697306-69921/root', '-a', '-u', 'mockbuild', '--capability=cap_ipc_lock', '--bind=/tmp/mock-resolv.3mlpk7kg:/etc/resolv.conf', '--bind=/dev/btrfs-control', '--bind=/dev/mapper/control', '--bind=/dev/fuse', '--bind=/dev/loop-control', '--bind=/dev/loop0', '--bind=/dev/loop1', '--bind=/dev/loop2', '--bind=/dev/loop3', '--bind=/dev/loop4', '--bind=/dev/loop5', '--bind=/dev/loop6', '--bind=/dev/loop7', '--bind=/dev/loop8', '--bind=/dev/loop9', '--bind=/dev/loop10', '--bind=/dev/loop11', '--console=pipe', '--setenv=TERM=vt100', '--setenv=SHELL=/bin/bash', '--setenv=HOME=/builddir', '--setenv=HOSTNAME=mock', '--setenv=PATH=/usr/bin:/bin:/usr/sbin:/sbin', '--setenv=PROMPT_COMMAND=printf "\\033]0;\\007"', '--setenv=PS1= \\s-\\v\\$ ', '--setenv=LANG=C.UTF-8', '--resolv-conf=off', 'bash', '--login', '-c', '/usr/bin/rpmbuild -ba --noprep --noclean --target noarch --nodeps /builddir/build/SPECS/python-pypandoc.spec'] with env {'TERM': 'vt100', 'SHELL': '/bin/bash', 'HOME': '/builddir', 'HOSTNAME': 'mock', 'PATH': '/usr/bin:/bin:/usr/sbin:/sbin', 'PROMPT_COMMAND': 'printf "\\033]0;\\007"', 'PS1': ' \\s-\\v\\$ ', 'LANG': 'C.UTF-8', 'SYSTEMD_NSPAWN_TMPFS_TMP': '0', 'SYSTEMD_SECCOMP': '0'} and shell False Building target platforms: noarch Building for target noarch setting SOURCE_DATE_EPOCH=1712188800 Executing(%generate_buildrequires): /bin/sh -e /var/tmp/rpm-tmp.EAH3Mc + umask 022 + cd /builddir/build/BUILD + cd pypandoc-1.13 + CFLAGS='-O2 -fexceptions -g -grecord-gcc-switches -pipe -Wall -Werror=format-security -Werror=implicit-function-declaration -Werror=implicit-int -Wp,-U_FORTIFY_SOURCE,-D_FORTIFY_SOURCE=3 -Wp,-D_GLIBCXX_ASSERTIONS -specs=/usr/lib/rpm/redhat/redhat-hardened-cc1 -fstack-protector-strong -specs=/usr/lib/rpm/redhat/redhat-annobin-cc1 -fasynchronous-unwind-tables -fno-omit-frame-pointer ' + export CFLAGS + CXXFLAGS='-O2 -fexceptions -g -grecord-gcc-switches -pipe -Wall -Werror=format-security -Wp,-U_FORTIFY_SOURCE,-D_FORTIFY_SOURCE=3 -Wp,-D_GLIBCXX_ASSERTIONS -specs=/usr/lib/rpm/redhat/redhat-hardened-cc1 -fstack-protector-strong -specs=/usr/lib/rpm/redhat/redhat-annobin-cc1 -fasynchronous-unwind-tables -fno-omit-frame-pointer ' + export CXXFLAGS + FFLAGS='-O2 -fexceptions -g -grecord-gcc-switches -pipe -Wall -Wp,-U_FORTIFY_SOURCE,-D_FORTIFY_SOURCE=3 -Wp,-D_GLIBCXX_ASSERTIONS -specs=/usr/lib/rpm/redhat/redhat-hardened-cc1 -fstack-protector-strong -specs=/usr/lib/rpm/redhat/redhat-annobin-cc1 -fasynchronous-unwind-tables -fno-omit-frame-pointer -I/usr/lib/gfortran/modules ' + export FFLAGS + FCFLAGS='-O2 -fexceptions -g -grecord-gcc-switches -pipe -Wall -Wp,-U_FORTIFY_SOURCE,-D_FORTIFY_SOURCE=3 -Wp,-D_GLIBCXX_ASSERTIONS -specs=/usr/lib/rpm/redhat/redhat-hardened-cc1 -fstack-protector-strong -specs=/usr/lib/rpm/redhat/redhat-annobin-cc1 -fasynchronous-unwind-tables -fno-omit-frame-pointer -I/usr/lib/gfortran/modules ' + export FCFLAGS + VALAFLAGS=-g + export VALAFLAGS + RUSTFLAGS='-Copt-level=3 -Cdebuginfo=2 -Ccodegen-units=1 -Cstrip=none -Cforce-frame-pointers=yes --cap-lints=warn' + export RUSTFLAGS + LDFLAGS='-Wl,-z,relro -Wl,--as-needed -Wl,-z,now -specs=/usr/lib/rpm/redhat/redhat-hardened-ld -specs=/usr/lib/rpm/redhat/redhat-annobin-cc1 -Wl,--build-id=sha1 ' + export LDFLAGS + LT_SYS_LIBRARY_PATH=/usr/lib: + export LT_SYS_LIBRARY_PATH + CC=gcc + export CC + CXX=g++ + export CXX + echo pyproject-rpm-macros + echo python3-devel + echo 'python3dist(pip) >= 19' + echo 'python3dist(packaging)' + '[' -f pyproject.toml ']' + echo '(python3dist(tomli) if python3-devel < 3.11)' + rm -rfv '*.dist-info/' + '[' -f /usr/bin/python3 ']' + mkdir -p /builddir/build/BUILD/pypandoc-1.13/.pyproject-builddir + echo -n + CFLAGS='-O2 -fexceptions -g -grecord-gcc-switches -pipe -Wall -Werror=format-security -Werror=implicit-function-declaration -Werror=implicit-int -Wp,-U_FORTIFY_SOURCE,-D_FORTIFY_SOURCE=3 -Wp,-D_GLIBCXX_ASSERTIONS -specs=/usr/lib/rpm/redhat/redhat-hardened-cc1 -fstack-protector-strong -specs=/usr/lib/rpm/redhat/redhat-annobin-cc1 -fasynchronous-unwind-tables -fno-omit-frame-pointer ' + LDFLAGS='-Wl,-z,relro -Wl,--as-needed -Wl,-z,now -specs=/usr/lib/rpm/redhat/redhat-hardened-ld -specs=/usr/lib/rpm/redhat/redhat-annobin-cc1 -Wl,--build-id=sha1 ' + TMPDIR=/builddir/build/BUILD/pypandoc-1.13/.pyproject-builddir + RPM_TOXENV=py312 + HOSTNAME=rpmbuild + /usr/bin/python3 -Bs /usr/lib/rpm/redhat/pyproject_buildrequires.py --generate-extras --python3_pkgversion 3 --wheeldir /builddir/build/BUILD/pypandoc-1.13/pyproject-wheeldir --output /builddir/build/BUILD/python-pypandoc-1.13-3.fc40.noarch-pyproject-buildrequires Handling poetry-core>=1.0.0 from build-system.requires Requirement satisfied: poetry-core>=1.0.0 (installed: poetry-core 1.8.1) + cat /builddir/build/BUILD/python-pypandoc-1.13-3.fc40.noarch-pyproject-buildrequires + rm -rfv pypandoc-1.13.dist-info/ removed 'pypandoc-1.13.dist-info/WHEEL' removed 'pypandoc-1.13.dist-info/LICENSE' removed 'pypandoc-1.13.dist-info/METADATA' removed directory 'pypandoc-1.13.dist-info/' + RPM_EC=0 ++ jobs -p + exit 0 Executing(%build): /bin/sh -e /var/tmp/rpm-tmp.tsRAZP + umask 022 + cd /builddir/build/BUILD + CFLAGS='-O2 -fexceptions -g -grecord-gcc-switches -pipe -Wall -Werror=format-security -Werror=implicit-function-declaration -Werror=implicit-int -Wp,-U_FORTIFY_SOURCE,-D_FORTIFY_SOURCE=3 -Wp,-D_GLIBCXX_ASSERTIONS -specs=/usr/lib/rpm/redhat/redhat-hardened-cc1 -fstack-protector-strong -specs=/usr/lib/rpm/redhat/redhat-annobin-cc1 -fasynchronous-unwind-tables -fno-omit-frame-pointer ' + export CFLAGS + CXXFLAGS='-O2 -fexceptions -g -grecord-gcc-switches -pipe -Wall -Werror=format-security -Wp,-U_FORTIFY_SOURCE,-D_FORTIFY_SOURCE=3 -Wp,-D_GLIBCXX_ASSERTIONS -specs=/usr/lib/rpm/redhat/redhat-hardened-cc1 -fstack-protector-strong -specs=/usr/lib/rpm/redhat/redhat-annobin-cc1 -fasynchronous-unwind-tables -fno-omit-frame-pointer ' + export CXXFLAGS + FFLAGS='-O2 -fexceptions -g -grecord-gcc-switches -pipe -Wall -Wp,-U_FORTIFY_SOURCE,-D_FORTIFY_SOURCE=3 -Wp,-D_GLIBCXX_ASSERTIONS -specs=/usr/lib/rpm/redhat/redhat-hardened-cc1 -fstack-protector-strong -specs=/usr/lib/rpm/redhat/redhat-annobin-cc1 -fasynchronous-unwind-tables -fno-omit-frame-pointer -I/usr/lib/gfortran/modules ' + export FFLAGS + FCFLAGS='-O2 -fexceptions -g -grecord-gcc-switches -pipe -Wall -Wp,-U_FORTIFY_SOURCE,-D_FORTIFY_SOURCE=3 -Wp,-D_GLIBCXX_ASSERTIONS -specs=/usr/lib/rpm/redhat/redhat-hardened-cc1 -fstack-protector-strong -specs=/usr/lib/rpm/redhat/redhat-annobin-cc1 -fasynchronous-unwind-tables -fno-omit-frame-pointer -I/usr/lib/gfortran/modules ' + export FCFLAGS + VALAFLAGS=-g + export VALAFLAGS + RUSTFLAGS='-Copt-level=3 -Cdebuginfo=2 -Ccodegen-units=1 -Cstrip=none -Cforce-frame-pointers=yes --cap-lints=warn' + export RUSTFLAGS + LDFLAGS='-Wl,-z,relro -Wl,--as-needed -Wl,-z,now -specs=/usr/lib/rpm/redhat/redhat-hardened-ld -specs=/usr/lib/rpm/redhat/redhat-annobin-cc1 -Wl,--build-id=sha1 ' + export LDFLAGS + LT_SYS_LIBRARY_PATH=/usr/lib: + export LT_SYS_LIBRARY_PATH + CC=gcc + export CC + CXX=g++ + export CXX + cd pypandoc-1.13 + mkdir -p /builddir/build/BUILD/pypandoc-1.13/.pyproject-builddir + CFLAGS='-O2 -fexceptions -g -grecord-gcc-switches -pipe -Wall -Werror=format-security -Werror=implicit-function-declaration -Werror=implicit-int -Wp,-U_FORTIFY_SOURCE,-D_FORTIFY_SOURCE=3 -Wp,-D_GLIBCXX_ASSERTIONS -specs=/usr/lib/rpm/redhat/redhat-hardened-cc1 -fstack-protector-strong -specs=/usr/lib/rpm/redhat/redhat-annobin-cc1 -fasynchronous-unwind-tables -fno-omit-frame-pointer ' + LDFLAGS='-Wl,-z,relro -Wl,--as-needed -Wl,-z,now -specs=/usr/lib/rpm/redhat/redhat-hardened-ld -specs=/usr/lib/rpm/redhat/redhat-annobin-cc1 -Wl,--build-id=sha1 ' + TMPDIR=/builddir/build/BUILD/pypandoc-1.13/.pyproject-builddir + /usr/bin/python3 -Bs /usr/lib/rpm/redhat/pyproject_wheel.py /builddir/build/BUILD/pypandoc-1.13/pyproject-wheeldir Processing /builddir/build/BUILD/pypandoc-1.13 Preparing metadata (pyproject.toml): started Running command Preparing metadata (pyproject.toml) Preparing metadata (pyproject.toml): finished with status 'done' Building wheels for collected packages: pypandoc Building wheel for pypandoc (pyproject.toml): started Running command Building wheel for pypandoc (pyproject.toml) Building wheel for pypandoc (pyproject.toml): finished with status 'done' Created wheel for pypandoc: filename=pypandoc-1.13-py3-none-any.whl size=20973 sha256=fdc225034001a590e635fcda72d0a8dc99fa5e8f2fe2c78f99a0327b213fd820 Stored in directory: /builddir/.cache/pip/wheels/b1/3a/8c/d63250a34fbb98cef443eadb8c991417beccbb08bb5b9fca29 Successfully built pypandoc + RPM_EC=0 ++ jobs -p + exit 0 Executing(%install): /bin/sh -e /var/tmp/rpm-tmp.oWZ6l8 + umask 022 + cd /builddir/build/BUILD + '[' /builddir/build/BUILDROOT/python-pypandoc-1.13-3.fc40.noarch '!=' / ']' + rm -rf /builddir/build/BUILDROOT/python-pypandoc-1.13-3.fc40.noarch ++ dirname /builddir/build/BUILDROOT/python-pypandoc-1.13-3.fc40.noarch + mkdir -p /builddir/build/BUILDROOT + mkdir /builddir/build/BUILDROOT/python-pypandoc-1.13-3.fc40.noarch + CFLAGS='-O2 -fexceptions -g -grecord-gcc-switches -pipe -Wall -Werror=format-security -Werror=implicit-function-declaration -Werror=implicit-int -Wp,-U_FORTIFY_SOURCE,-D_FORTIFY_SOURCE=3 -Wp,-D_GLIBCXX_ASSERTIONS -specs=/usr/lib/rpm/redhat/redhat-hardened-cc1 -fstack-protector-strong -specs=/usr/lib/rpm/redhat/redhat-annobin-cc1 -fasynchronous-unwind-tables -fno-omit-frame-pointer ' + export CFLAGS + CXXFLAGS='-O2 -fexceptions -g -grecord-gcc-switches -pipe -Wall -Werror=format-security -Wp,-U_FORTIFY_SOURCE,-D_FORTIFY_SOURCE=3 -Wp,-D_GLIBCXX_ASSERTIONS -specs=/usr/lib/rpm/redhat/redhat-hardened-cc1 -fstack-protector-strong -specs=/usr/lib/rpm/redhat/redhat-annobin-cc1 -fasynchronous-unwind-tables -fno-omit-frame-pointer ' + export CXXFLAGS + FFLAGS='-O2 -fexceptions -g -grecord-gcc-switches -pipe -Wall -Wp,-U_FORTIFY_SOURCE,-D_FORTIFY_SOURCE=3 -Wp,-D_GLIBCXX_ASSERTIONS -specs=/usr/lib/rpm/redhat/redhat-hardened-cc1 -fstack-protector-strong -specs=/usr/lib/rpm/redhat/redhat-annobin-cc1 -fasynchronous-unwind-tables -fno-omit-frame-pointer -I/usr/lib/gfortran/modules ' + export FFLAGS + FCFLAGS='-O2 -fexceptions -g -grecord-gcc-switches -pipe -Wall -Wp,-U_FORTIFY_SOURCE,-D_FORTIFY_SOURCE=3 -Wp,-D_GLIBCXX_ASSERTIONS -specs=/usr/lib/rpm/redhat/redhat-hardened-cc1 -fstack-protector-strong -specs=/usr/lib/rpm/redhat/redhat-annobin-cc1 -fasynchronous-unwind-tables -fno-omit-frame-pointer -I/usr/lib/gfortran/modules ' + export FCFLAGS + VALAFLAGS=-g + export VALAFLAGS + RUSTFLAGS='-Copt-level=3 -Cdebuginfo=2 -Ccodegen-units=1 -Cstrip=none -Cforce-frame-pointers=yes --cap-lints=warn' + export RUSTFLAGS + LDFLAGS='-Wl,-z,relro -Wl,--as-needed -Wl,-z,now -specs=/usr/lib/rpm/redhat/redhat-hardened-ld -specs=/usr/lib/rpm/redhat/redhat-annobin-cc1 -Wl,--build-id=sha1 ' + export LDFLAGS + LT_SYS_LIBRARY_PATH=/usr/lib: + export LT_SYS_LIBRARY_PATH + CC=gcc + export CC + CXX=g++ + export CXX + cd pypandoc-1.13 ++ ls /builddir/build/BUILD/pypandoc-1.13/pyproject-wheeldir/pypandoc-1.13-py3-none-any.whl ++ xargs basename --multiple ++ sed -E 's/([^-]+)-([^-]+)-.+\.whl/\1==\2/' + specifier=pypandoc==1.13 + '[' -z pypandoc==1.13 ']' + TMPDIR=/builddir/build/BUILD/pypandoc-1.13/.pyproject-builddir + /usr/bin/python3 -m pip install --root /builddir/build/BUILDROOT/python-pypandoc-1.13-3.fc40.noarch --prefix /usr --no-deps --disable-pip-version-check --progress-bar off --verbose --ignore-installed --no-warn-script-location --no-index --no-cache-dir --find-links /builddir/build/BUILD/pypandoc-1.13/pyproject-wheeldir pypandoc==1.13 Using pip 23.3.2 from /usr/lib/python3.12/site-packages/pip (python 3.12) Looking in links: /builddir/build/BUILD/pypandoc-1.13/pyproject-wheeldir Processing ./pyproject-wheeldir/pypandoc-1.13-py3-none-any.whl Installing collected packages: pypandoc Successfully installed pypandoc-1.13 + '[' -d /builddir/build/BUILDROOT/python-pypandoc-1.13-3.fc40.noarch/usr/bin ']' + rm -f /builddir/build/BUILD/python-pypandoc-1.13-3.fc40.noarch-pyproject-ghost-distinfo + site_dirs=() + '[' -d /builddir/build/BUILDROOT/python-pypandoc-1.13-3.fc40.noarch/usr/lib/python3.12/site-packages ']' + site_dirs+=("/usr/lib/python3.12/site-packages") + '[' /builddir/build/BUILDROOT/python-pypandoc-1.13-3.fc40.noarch/usr/lib64/python3.12/site-packages '!=' /builddir/build/BUILDROOT/python-pypandoc-1.13-3.fc40.noarch/usr/lib/python3.12/site-packages ']' + '[' -d /builddir/build/BUILDROOT/python-pypandoc-1.13-3.fc40.noarch/usr/lib64/python3.12/site-packages ']' + for site_dir in ${site_dirs[@]} + for distinfo in /builddir/build/BUILDROOT/python-pypandoc-1.13-3.fc40.noarch$site_dir/*.dist-info + echo '%ghost /usr/lib/python3.12/site-packages/pypandoc-1.13.dist-info' + sed -i s/pip/rpm/ /builddir/build/BUILDROOT/python-pypandoc-1.13-3.fc40.noarch/usr/lib/python3.12/site-packages/pypandoc-1.13.dist-info/INSTALLER + PYTHONPATH=/usr/lib/rpm/redhat + /usr/bin/python3 -B /usr/lib/rpm/redhat/pyproject_preprocess_record.py --buildroot /builddir/build/BUILDROOT/python-pypandoc-1.13-3.fc40.noarch --record /builddir/build/BUILDROOT/python-pypandoc-1.13-3.fc40.noarch/usr/lib/python3.12/site-packages/pypandoc-1.13.dist-info/RECORD --output /builddir/build/BUILD/python-pypandoc-1.13-3.fc40.noarch-pyproject-record + rm -fv /builddir/build/BUILDROOT/python-pypandoc-1.13-3.fc40.noarch/usr/lib/python3.12/site-packages/pypandoc-1.13.dist-info/RECORD removed '/builddir/build/BUILDROOT/python-pypandoc-1.13-3.fc40.noarch/usr/lib/python3.12/site-packages/pypandoc-1.13.dist-info/RECORD' + rm -fv /builddir/build/BUILDROOT/python-pypandoc-1.13-3.fc40.noarch/usr/lib/python3.12/site-packages/pypandoc-1.13.dist-info/REQUESTED removed '/builddir/build/BUILDROOT/python-pypandoc-1.13-3.fc40.noarch/usr/lib/python3.12/site-packages/pypandoc-1.13.dist-info/REQUESTED' ++ wc -l /builddir/build/BUILD/python-pypandoc-1.13-3.fc40.noarch-pyproject-ghost-distinfo ++ cut -f1 '-d ' + lines=1 + '[' 1 -ne 1 ']' + RPM_PERCENTAGES_COUNT=2 + /usr/bin/python3 /usr/lib/rpm/redhat/pyproject_save_files.py --output-files /builddir/build/BUILD/python-pypandoc-1.13-3.fc40.noarch-pyproject-files --output-modules /builddir/build/BUILD/python-pypandoc-1.13-3.fc40.noarch-pyproject-modules --buildroot /builddir/build/BUILDROOT/python-pypandoc-1.13-3.fc40.noarch --sitelib /usr/lib/python3.12/site-packages --sitearch /usr/lib64/python3.12/site-packages --python-version 3.12 --pyproject-record /builddir/build/BUILD/python-pypandoc-1.13-3.fc40.noarch-pyproject-record --prefix /usr -L pypandoc + /usr/bin/find-debuginfo -j64 --strict-build-id -m -i --build-id-seed 1.13-3.fc40 --unique-debug-suffix -1.13-3.fc40.noarch --unique-debug-src-base python-pypandoc-1.13-3.fc40.noarch --run-dwz --dwz-low-mem-die-limit 10000000 --dwz-max-die-limit 50000000 -S debugsourcefiles.list /builddir/build/BUILD/pypandoc-1.13 find-debuginfo: starting Extracting debug info from 0 files Creating .debug symlinks for symlinks to ELF files find: ‘debug’: No such file or directory find-debuginfo: done + /usr/lib/rpm/check-buildroot + /usr/lib/rpm/redhat/brp-ldconfig + /usr/lib/rpm/brp-compress + /usr/lib/rpm/redhat/brp-strip-lto /usr/bin/strip + /usr/lib/rpm/brp-strip-static-archive /usr/bin/strip + /usr/lib/rpm/check-rpaths + /usr/lib/rpm/redhat/brp-mangle-shebangs + /usr/lib/rpm/brp-remove-la-files + env /usr/lib/rpm/redhat/brp-python-bytecompile '' 1 0 -j64 Bytecompiling .py files below /builddir/build/BUILDROOT/python-pypandoc-1.13-3.fc40.noarch/usr/lib/python3.12 using python3.12 /usr/lib/python3.12/site-packages/pypandoc/pandoc_download.py:61: SyntaxWarning: invalid escape sequence '\.' /usr/lib/python3.12/site-packages/pypandoc/pandoc_download.py:61: SyntaxWarning: invalid escape sequence '\.' + /usr/lib/rpm/redhat/brp-python-hardlink Executing(%check): /bin/sh -e /var/tmp/rpm-tmp.jBDsN6 + umask 022 + cd /builddir/build/BUILD + CFLAGS='-O2 -fexceptions -g -grecord-gcc-switches -pipe -Wall -Werror=format-security -Werror=implicit-function-declaration -Werror=implicit-int -Wp,-U_FORTIFY_SOURCE,-D_FORTIFY_SOURCE=3 -Wp,-D_GLIBCXX_ASSERTIONS -specs=/usr/lib/rpm/redhat/redhat-hardened-cc1 -fstack-protector-strong -specs=/usr/lib/rpm/redhat/redhat-annobin-cc1 -fasynchronous-unwind-tables -fno-omit-frame-pointer ' + export CFLAGS + CXXFLAGS='-O2 -fexceptions -g -grecord-gcc-switches -pipe -Wall -Werror=format-security -Wp,-U_FORTIFY_SOURCE,-D_FORTIFY_SOURCE=3 -Wp,-D_GLIBCXX_ASSERTIONS -specs=/usr/lib/rpm/redhat/redhat-hardened-cc1 -fstack-protector-strong -specs=/usr/lib/rpm/redhat/redhat-annobin-cc1 -fasynchronous-unwind-tables -fno-omit-frame-pointer ' + export CXXFLAGS + FFLAGS='-O2 -fexceptions -g -grecord-gcc-switches -pipe -Wall -Wp,-U_FORTIFY_SOURCE,-D_FORTIFY_SOURCE=3 -Wp,-D_GLIBCXX_ASSERTIONS -specs=/usr/lib/rpm/redhat/redhat-hardened-cc1 -fstack-protector-strong -specs=/usr/lib/rpm/redhat/redhat-annobin-cc1 -fasynchronous-unwind-tables -fno-omit-frame-pointer -I/usr/lib/gfortran/modules ' + export FFLAGS + FCFLAGS='-O2 -fexceptions -g -grecord-gcc-switches -pipe -Wall -Wp,-U_FORTIFY_SOURCE,-D_FORTIFY_SOURCE=3 -Wp,-D_GLIBCXX_ASSERTIONS -specs=/usr/lib/rpm/redhat/redhat-hardened-cc1 -fstack-protector-strong -specs=/usr/lib/rpm/redhat/redhat-annobin-cc1 -fasynchronous-unwind-tables -fno-omit-frame-pointer -I/usr/lib/gfortran/modules ' + export FCFLAGS + VALAFLAGS=-g + export VALAFLAGS + RUSTFLAGS='-Copt-level=3 -Cdebuginfo=2 -Ccodegen-units=1 -Cstrip=none -Cforce-frame-pointers=yes --cap-lints=warn' + export RUSTFLAGS + LDFLAGS='-Wl,-z,relro -Wl,--as-needed -Wl,-z,now -specs=/usr/lib/rpm/redhat/redhat-hardened-ld -specs=/usr/lib/rpm/redhat/redhat-annobin-cc1 -Wl,--build-id=sha1 ' + export LDFLAGS + LT_SYS_LIBRARY_PATH=/usr/lib: + export LT_SYS_LIBRARY_PATH + CC=gcc + export CC + CXX=g++ + export CXX + cd pypandoc-1.13 + sed -i -r 's/test_basic_conversion_from_http_url/_disabled_\0/' tests.py + sed -i -r 's/test_basic_conversion_from_file_pattern/_disabled_\0/' tests.py + sed -i -r 's/test_conversion_with_data_files/_disabled_\0/' tests.py + /usr/bin/python3 tests.py /builddir/build/BUILD/pypandoc-1.13/pypandoc/pandoc_download.py:61: SyntaxWarning: invalid escape sequence '\.' regex = re.compile(r"/jgm/pandoc/releases/download/.*(?:"+processor_architecture+"|x86|mac).*\.(?:msi|deb|pkg)") test_basic_conversion_from_file (__main__.TestPypandoc.test_basic_conversion_from_file) ... ok test_basic_conversion_from_file_pathlib (__main__.TestPypandoc.test_basic_conversion_from_file_pathlib) ... ok test_basic_conversion_from_file_url (__main__.TestPypandoc.test_basic_conversion_from_file_url) ... ok test_basic_conversion_from_file_with_format (__main__.TestPypandoc.test_basic_conversion_from_file_with_format) ... ok test_basic_conversion_from_multiple_files (__main__.TestPypandoc.test_basic_conversion_from_multiple_files) ... ok test_basic_conversion_from_multiple_files_pathlib (__main__.TestPypandoc.test_basic_conversion_from_multiple_files_pathlib) ... ok test_basic_conversion_from_string (__main__.TestPypandoc.test_basic_conversion_from_string) ... ok test_basic_conversion_to_file (__main__.TestPypandoc.test_basic_conversion_to_file) ... ok test_basic_conversion_to_pathlib_file (__main__.TestPypandoc.test_basic_conversion_to_pathlib_file) ... ok test_call_with_nonexisting_file (__main__.TestPypandoc.test_call_with_nonexisting_file) ... ok test_classify_pandoc_logging (__main__.TestPypandoc.test_classify_pandoc_logging) ... ok test_classify_pandoc_logging_default (__main__.TestPypandoc.test_classify_pandoc_logging_default) ... ok test_classify_pandoc_logging_invalid_level (__main__.TestPypandoc.test_classify_pandoc_logging_invalid_level) ... ok test_conversion_error (__main__.TestPypandoc.test_conversion_error) ... ok test_conversion_from_markdown_with_extensions (__main__.TestPypandoc.test_conversion_from_markdown_with_extensions) ... ok test_conversion_from_non_plain_text_file (__main__.TestPypandoc.test_conversion_from_non_plain_text_file) ... ok test_conversion_stderr (__main__.TestPypandoc.test_conversion_stderr) ... ok test_conversion_stderr_nullhandler (__main__.TestPypandoc.test_conversion_stderr_nullhandler) ... ok test_conversion_with_empty_filter (__main__.TestPypandoc.test_conversion_with_empty_filter) ... ok test_conversion_with_lua_filter (__main__.TestPypandoc.test_conversion_with_lua_filter) ... ok test_conversion_with_markdown_extensions (__main__.TestPypandoc.test_conversion_with_markdown_extensions) ... ok test_conversion_with_mixed_filters (__main__.TestPypandoc.test_conversion_with_mixed_filters) ... FAIL test_conversion_with_python_filter (__main__.TestPypandoc.test_conversion_with_python_filter) ... ok test_convert_text_with_existing_file (__main__.TestPypandoc.test_convert_text_with_existing_file) ... ok test_convert_with_custom_writer (__main__.TestPypandoc.test_convert_with_custom_writer) ... ok test_converts_valid_format (__main__.TestPypandoc.test_converts_valid_format) ... ok test_does_not_convert_from_invalid_format (__main__.TestPypandoc.test_does_not_convert_from_invalid_format) ... ok test_does_not_convert_to_invalid_format (__main__.TestPypandoc.test_does_not_convert_to_invalid_format) ... ok test_ensure_pandoc_maximal_version (__main__.TestPypandoc.test_ensure_pandoc_maximal_version) ... ok test_ensure_pandoc_minimal_version (__main__.TestPypandoc.test_ensure_pandoc_minimal_version) ... ok test_get_pandoc_formats (__main__.TestPypandoc.test_get_pandoc_formats) ... ok test_get_pandoc_path (__main__.TestPypandoc.test_get_pandoc_path) ... ok test_get_pandoc_version (__main__.TestPypandoc.test_get_pandoc_version) ... ok test_pdf_conversion (__main__.TestPypandoc.test_pdf_conversion) ... ok test_unicode_input (__main__.TestPypandoc.test_unicode_input) ... ok ====================================================================== FAIL: test_conversion_with_mixed_filters (__main__.TestPypandoc.test_conversion_with_mixed_filters) ---------------------------------------------------------------------- Traceback (most recent call last): File "/builddir/build/BUILD/pypandoc-1.13/tests.py", line 413, in test_conversion_with_mixed_filters self.assertEquals(output, expected) ^^^^^^^^^^^^^^^^^ AttributeError: 'TestPypandoc' object has no attribute 'assertEquals'. Did you mean: 'assertEqual'? During handling of the above exception, another exception occurred: Traceback (most recent call last): File "/builddir/build/BUILD/pypandoc-1.13/tests.py", line 416, in test_conversion_with_mixed_filters self.assertEqual(output, expected) AssertionError: '' != '

-0-1-2-3-4-

' +

-0-1-2-3-4-

---------------------------------------------------------------------- Ran 35 tests in 13.461s FAILED (failures=1) /builddir /builddir /builddir /builddir /builddir /builddir /builddir /builddir /builddir /builddir /builddir /builddir /builddir /builddir /builddir /builddir /builddir [warning] could not fetch resource missing.png: pandocresourcenotfound "missing.png" [warning] could not fetch resource missing.png: pandocresourcenotfound "missing.png" /builddir /builddir /builddir /builddir /builddir /builddir /builddir /builddir /builddir /builddir /builddir /builddir /builddir /builddir /builddir /builddir /builddir /builddir error: Bad exit status from /var/tmp/rpm-tmp.jBDsN6 (%check) Bad exit status from /var/tmp/rpm-tmp.jBDsN6 (%check) RPM build errors: Child return code was: 1 EXCEPTION: [Error('Command failed: \n # /usr/bin/systemd-nspawn -q -M 23881c087e044d67baac6f4acdb8e7ac -D /var/lib/mock/f40-build-2697306-69921/root -a -u mockbuild --capability=cap_ipc_lock --bind=/tmp/mock-resolv.3mlpk7kg:/etc/resolv.conf --bind=/dev/btrfs-control --bind=/dev/mapper/control --bind=/dev/fuse --bind=/dev/loop-control --bind=/dev/loop0 --bind=/dev/loop1 --bind=/dev/loop2 --bind=/dev/loop3 --bind=/dev/loop4 --bind=/dev/loop5 --bind=/dev/loop6 --bind=/dev/loop7 --bind=/dev/loop8 --bind=/dev/loop9 --bind=/dev/loop10 --bind=/dev/loop11 --console=pipe --setenv=TERM=vt100 --setenv=SHELL=/bin/bash --setenv=HOME=/builddir --setenv=HOSTNAME=mock --setenv=PATH=/usr/bin:/bin:/usr/sbin:/sbin \'--setenv=PROMPT_COMMAND=printf "\\033]0;\\007"\' \'--setenv=PS1= \\s-\\v\\$ \' --setenv=LANG=C.UTF-8 --resolv-conf=off bash --login -c \'/usr/bin/rpmbuild -ba --noprep --noclean --target noarch --nodeps /builddir/build/SPECS/python-pypandoc.spec\'\n', 1)] Traceback (most recent call last): File "/usr/lib/python3.12/site-packages/mockbuild/trace_decorator.py", line 93, in trace result = func(*args, **kw) ^^^^^^^^^^^^^^^^^ File "/usr/lib/python3.12/site-packages/mockbuild/util.py", line 612, in do_with_status raise exception.Error("Command failed: \n # %s\n%s" % (cmd_pretty(command, env), output), child.returncode) mockbuild.exception.Error: Command failed: # /usr/bin/systemd-nspawn -q -M 23881c087e044d67baac6f4acdb8e7ac -D /var/lib/mock/f40-build-2697306-69921/root -a -u mockbuild --capability=cap_ipc_lock --bind=/tmp/mock-resolv.3mlpk7kg:/etc/resolv.conf --bind=/dev/btrfs-control --bind=/dev/mapper/control --bind=/dev/fuse --bind=/dev/loop-control --bind=/dev/loop0 --bind=/dev/loop1 --bind=/dev/loop2 --bind=/dev/loop3 --bind=/dev/loop4 --bind=/dev/loop5 --bind=/dev/loop6 --bind=/dev/loop7 --bind=/dev/loop8 --bind=/dev/loop9 --bind=/dev/loop10 --bind=/dev/loop11 --console=pipe --setenv=TERM=vt100 --setenv=SHELL=/bin/bash --setenv=HOME=/builddir --setenv=HOSTNAME=mock --setenv=PATH=/usr/bin:/bin:/usr/sbin:/sbin '--setenv=PROMPT_COMMAND=printf "\033]0;\007"' '--setenv=PS1= \s-\v\$ ' --setenv=LANG=C.UTF-8 --resolv-conf=off bash --login -c '/usr/bin/rpmbuild -ba --noprep --noclean --target noarch --nodeps /builddir/build/SPECS/python-pypandoc.spec'