Mock Version: 3.5 Mock Version: 3.5 Mock Version: 3.5 ENTER ['do_with_status'](['bash', '--login', '-c', '/usr/bin/rpmbuild -bs --noclean --target riscv64 --nodeps /builddir/build/SPECS/varnish-modules.spec'], chrootPath='/var/lib/mock/f38-build-side-42-init-devel-1063288-29775/root'env={'TERM': 'vt100', 'SHELL': '/bin/bash', 'HOME': '/builddir', 'HOSTNAME': 'mock', 'PATH': '/usr/bin:/bin:/usr/sbin:/sbin', 'PROMPT_COMMAND': 'printf "\\033]0;\\007"', 'PS1': ' \\s-\\v\\$ ', 'LANG': 'C.UTF-8'}shell=Falselogger=timeout=864000uid=996gid=135user='mockbuild'nspawn_args=[]unshare_net=TrueprintOutput=False) Executing command: ['bash', '--login', '-c', '/usr/bin/rpmbuild -bs --noclean --target riscv64 --nodeps /builddir/build/SPECS/varnish-modules.spec'] with env {'TERM': 'vt100', 'SHELL': '/bin/bash', 'HOME': '/builddir', 'HOSTNAME': 'mock', 'PATH': '/usr/bin:/bin:/usr/sbin:/sbin', 'PROMPT_COMMAND': 'printf "\\033]0;\\007"', 'PS1': ' \\s-\\v\\$ ', 'LANG': 'C.UTF-8'} and shell False Building target platforms: riscv64 Building for target riscv64 setting SOURCE_DATE_EPOCH=1674259200 Wrote: /builddir/build/SRPMS/varnish-modules-0.21.0-3.fc38.src.rpm Child return code was: 0 ENTER ['do_with_status'](['bash', '--login', '-c', '/usr/bin/rpmbuild -bb --noclean --target riscv64 --nodeps /builddir/build/SPECS/varnish-modules.spec'], chrootPath='/var/lib/mock/f38-build-side-42-init-devel-1063288-29775/root'env={'TERM': 'vt100', 'SHELL': '/bin/bash', 'HOME': '/builddir', 'HOSTNAME': 'mock', 'PATH': '/usr/bin:/bin:/usr/sbin:/sbin', 'PROMPT_COMMAND': 'printf "\\033]0;\\007"', 'PS1': ' \\s-\\v\\$ ', 'LANG': 'C.UTF-8'}shell=Falselogger=timeout=864000uid=996gid=135user='mockbuild'nspawn_args=[]unshare_net=TrueprintOutput=False) Executing command: ['bash', '--login', '-c', '/usr/bin/rpmbuild -bb --noclean --target riscv64 --nodeps /builddir/build/SPECS/varnish-modules.spec'] with env {'TERM': 'vt100', 'SHELL': '/bin/bash', 'HOME': '/builddir', 'HOSTNAME': 'mock', 'PATH': '/usr/bin:/bin:/usr/sbin:/sbin', 'PROMPT_COMMAND': 'printf "\\033]0;\\007"', 'PS1': ' \\s-\\v\\$ ', 'LANG': 'C.UTF-8'} and shell False Building target platforms: riscv64 Building for target riscv64 setting SOURCE_DATE_EPOCH=1674259200 Executing(%prep): /bin/sh -e /var/tmp/rpm-tmp.3NwpxJ + umask 022 + cd /builddir/build/BUILD + cd /builddir/build/BUILD + rm -rf varnish-modules-0.21.0 + /usr/lib/rpm/rpmuncompress -x /builddir/build/SOURCES/varnish-modules-0.21.0.tar.gz + STATUS=0 + '[' 0 -ne 0 ']' + cd varnish-modules-0.21.0 + /usr/bin/chmod -Rf a+rX,u+w,g-w,o-w . + RPM_EC=0 ++ jobs -p + exit 0 Executing(%build): /bin/sh -e /var/tmp/rpm-tmp.AAVYCv + umask 022 + cd /builddir/build/BUILD + CFLAGS='-O2 -flto=auto -ffat-lto-objects -fexceptions -g -grecord-gcc-switches -pipe -Wall -Werror=format-security -Wp,-U_FORTIFY_SOURCE,-D_FORTIFY_SOURCE=3 -Wp,-D_GLIBCXX_ASSERTIONS -specs=/usr/lib/rpm/redhat/redhat-hardened-cc1 -fstack-protector-strong -specs=/usr/lib/rpm/redhat/redhat-annobin-cc1 -fasynchronous-unwind-tables -fstack-clash-protection -fno-omit-frame-pointer ' + export CFLAGS + CXXFLAGS='-O2 -flto=auto -ffat-lto-objects -fexceptions -g -grecord-gcc-switches -pipe -Wall -Werror=format-security -Wp,-U_FORTIFY_SOURCE,-D_FORTIFY_SOURCE=3 -Wp,-D_GLIBCXX_ASSERTIONS -specs=/usr/lib/rpm/redhat/redhat-hardened-cc1 -fstack-protector-strong -specs=/usr/lib/rpm/redhat/redhat-annobin-cc1 -fasynchronous-unwind-tables -fstack-clash-protection -fno-omit-frame-pointer ' + export CXXFLAGS + FFLAGS='-O2 -flto=auto -ffat-lto-objects -fexceptions -g -grecord-gcc-switches -pipe -Wall -Werror=format-security -Wp,-U_FORTIFY_SOURCE,-D_FORTIFY_SOURCE=3 -Wp,-D_GLIBCXX_ASSERTIONS -specs=/usr/lib/rpm/redhat/redhat-hardened-cc1 -fstack-protector-strong -specs=/usr/lib/rpm/redhat/redhat-annobin-cc1 -fasynchronous-unwind-tables -fstack-clash-protection -fno-omit-frame-pointer -I/usr/lib64/gfortran/modules ' + export FFLAGS + FCFLAGS='-O2 -flto=auto -ffat-lto-objects -fexceptions -g -grecord-gcc-switches -pipe -Wall -Werror=format-security -Wp,-U_FORTIFY_SOURCE,-D_FORTIFY_SOURCE=3 -Wp,-D_GLIBCXX_ASSERTIONS -specs=/usr/lib/rpm/redhat/redhat-hardened-cc1 -fstack-protector-strong -specs=/usr/lib/rpm/redhat/redhat-annobin-cc1 -fasynchronous-unwind-tables -fstack-clash-protection -fno-omit-frame-pointer -I/usr/lib64/gfortran/modules ' + export FCFLAGS + VALAFLAGS=-g + export VALAFLAGS + LDFLAGS='-Wl,-z,relro -Wl,--as-needed -Wl,-z,now -specs=/usr/lib/rpm/redhat/redhat-hardened-ld -specs=/usr/lib/rpm/redhat/redhat-annobin-cc1 -Wl,--build-id=sha1 -specs=/usr/lib/rpm/redhat/redhat-package-notes ' + export LDFLAGS + LT_SYS_LIBRARY_PATH=/usr/lib64: + export LT_SYS_LIBRARY_PATH + CC=gcc + export CC + CXX=g++ + export CXX + cd varnish-modules-0.21.0 + export RST2MAN=rst2man + RST2MAN=rst2man + CFLAGS='-O2 -flto=auto -ffat-lto-objects -fexceptions -g -grecord-gcc-switches -pipe -Wall -Werror=format-security -Wp,-U_FORTIFY_SOURCE,-D_FORTIFY_SOURCE=3 -Wp,-D_GLIBCXX_ASSERTIONS -specs=/usr/lib/rpm/redhat/redhat-hardened-cc1 -fstack-protector-strong -specs=/usr/lib/rpm/redhat/redhat-annobin-cc1 -fasynchronous-unwind-tables -fstack-clash-protection -fno-omit-frame-pointer ' + export CFLAGS + CXXFLAGS='-O2 -flto=auto -ffat-lto-objects -fexceptions -g -grecord-gcc-switches -pipe -Wall -Werror=format-security -Wp,-U_FORTIFY_SOURCE,-D_FORTIFY_SOURCE=3 -Wp,-D_GLIBCXX_ASSERTIONS -specs=/usr/lib/rpm/redhat/redhat-hardened-cc1 -fstack-protector-strong -specs=/usr/lib/rpm/redhat/redhat-annobin-cc1 -fasynchronous-unwind-tables -fstack-clash-protection -fno-omit-frame-pointer ' + export CXXFLAGS + FFLAGS='-O2 -flto=auto -ffat-lto-objects -fexceptions -g -grecord-gcc-switches -pipe -Wall -Werror=format-security -Wp,-U_FORTIFY_SOURCE,-D_FORTIFY_SOURCE=3 -Wp,-D_GLIBCXX_ASSERTIONS -specs=/usr/lib/rpm/redhat/redhat-hardened-cc1 -fstack-protector-strong -specs=/usr/lib/rpm/redhat/redhat-annobin-cc1 -fasynchronous-unwind-tables -fstack-clash-protection -fno-omit-frame-pointer -I/usr/lib64/gfortran/modules ' + export FFLAGS + FCFLAGS='-O2 -flto=auto -ffat-lto-objects -fexceptions -g -grecord-gcc-switches -pipe -Wall -Werror=format-security -Wp,-U_FORTIFY_SOURCE,-D_FORTIFY_SOURCE=3 -Wp,-D_GLIBCXX_ASSERTIONS -specs=/usr/lib/rpm/redhat/redhat-hardened-cc1 -fstack-protector-strong -specs=/usr/lib/rpm/redhat/redhat-annobin-cc1 -fasynchronous-unwind-tables -fstack-clash-protection -fno-omit-frame-pointer -I/usr/lib64/gfortran/modules ' + export FCFLAGS + VALAFLAGS=-g + export VALAFLAGS + LDFLAGS='-Wl,-z,relro -Wl,--as-needed -Wl,-z,now -specs=/usr/lib/rpm/redhat/redhat-hardened-ld -specs=/usr/lib/rpm/redhat/redhat-annobin-cc1 -Wl,--build-id=sha1 -specs=/usr/lib/rpm/redhat/redhat-package-notes ' + export LDFLAGS + LT_SYS_LIBRARY_PATH=/usr/lib64: + export LT_SYS_LIBRARY_PATH + CC=gcc + export CC + CXX=g++ + export CXX + '[' '-flto=auto -ffat-lto-objectsx' '!=' x ']' ++ find . -type f -name configure -print + for file in $(find . -type f -name configure -print) + /usr/bin/sed -r --in-place=.backup 's/^char \(\*f\) \(\) = /__attribute__ ((used)) char (*f) () = /g' ./configure + diff -u ./configure.backup ./configure + mv ./configure.backup ./configure + /usr/bin/sed -r --in-place=.backup 's/^char \(\*f\) \(\);/__attribute__ ((used)) char (*f) ();/g' ./configure + diff -u ./configure.backup ./configure + mv ./configure.backup ./configure + /usr/bin/sed -r --in-place=.backup 's/^char \$2 \(\);/__attribute__ ((used)) char \$2 ();/g' ./configure + diff -u ./configure.backup ./configure --- ./configure.backup 2022-09-15 14:00:02.000000000 -0400 +++ ./configure 2023-08-07 11:28:09.943718282 -0400 @@ -1906,7 +1906,7 @@ #ifdef __cplusplus extern "C" #endif -char $2 (); +__attribute__ ((used)) char $2 (); /* The GNU C library defines this for functions which it implements to always fail with ENOSYS. Some functions are actually named something starting with __ and the normal name is an alias. */ + /usr/bin/sed --in-place=.backup '1{$!N;$!N};$!N;s/int x = 1;\nint y = 0;\nint z;\nint nan;/volatile int x = 1; volatile int y = 0; volatile int z, nan;/;P;D' ./configure + diff -u ./configure.backup ./configure + mv ./configure.backup ./configure + /usr/bin/sed --in-place=.backup 's#^lt_cv_sys_global_symbol_to_cdecl=.*#lt_cv_sys_global_symbol_to_cdecl="sed -n -e '\''s/^T .* \\(.*\\)$/extern int \\1();/p'\'' -e '\''s/^$symcode* .* \\(.*\\)$/extern char \\1;/p'\''"#' ./configure + diff -u ./configure.backup ./configure --- ./configure.backup 2023-08-07 11:28:09.943718282 -0400 +++ ./configure 2023-08-07 11:28:10.893718248 -0400 @@ -7046,7 +7046,7 @@ # Transform an extracted symbol line into a proper C declaration. # Some systems (esp. on ia64) link data and code symbols differently, # so use this general approach. -lt_cv_sys_global_symbol_to_cdecl="$SED -n"\ +lt_cv_sys_global_symbol_to_cdecl="sed -n -e 's/^T .* \(.*\)$/extern int \1();/p' -e 's/^$symcode* .* \(.*\)$/extern char \1;/p'" $lt_cdecl_hook\ " -e 's/^T .* \(.*\)$/extern int \1();/p'"\ " -e 's/^$symcode$symcode* .* \(.*\)$/extern char \1;/p'" @@ -16229,7 +16229,7 @@ compiler='`$ECHO "$compiler" | $SED "$delay_single_quote_subst"`' GCC='`$ECHO "$GCC" | $SED "$delay_single_quote_subst"`' lt_cv_sys_global_symbol_pipe='`$ECHO "$lt_cv_sys_global_symbol_pipe" | $SED "$delay_single_quote_subst"`' -lt_cv_sys_global_symbol_to_cdecl='`$ECHO "$lt_cv_sys_global_symbol_to_cdecl" | $SED "$delay_single_quote_subst"`' +lt_cv_sys_global_symbol_to_cdecl="sed -n -e 's/^T .* \(.*\)$/extern int \1();/p' -e 's/^$symcode* .* \(.*\)$/extern char \1;/p'" lt_cv_sys_global_symbol_to_import='`$ECHO "$lt_cv_sys_global_symbol_to_import" | $SED "$delay_single_quote_subst"`' lt_cv_sys_global_symbol_to_c_name_address='`$ECHO "$lt_cv_sys_global_symbol_to_c_name_address" | $SED "$delay_single_quote_subst"`' lt_cv_sys_global_symbol_to_c_name_address_lib_prefix='`$ECHO "$lt_cv_sys_global_symbol_to_c_name_address_lib_prefix" | $SED "$delay_single_quote_subst"`' + '[' 1 = 1 ']' +++ dirname ./configure ++ find . -name config.guess -o -name config.sub + for i in $(find $(dirname ./configure) -name config.guess -o -name config.sub) ++ basename ./build-aux/config.sub + '[' -f /usr/lib/rpm/redhat/config.sub ']' + /usr/bin/rm -f ./build-aux/config.sub ++ basename ./build-aux/config.sub + /usr/bin/cp -fv /usr/lib/rpm/redhat/config.sub ./build-aux/config.sub '/usr/lib/rpm/redhat/config.sub' -> './build-aux/config.sub' + for i in $(find $(dirname ./configure) -name config.guess -o -name config.sub) ++ basename ./build-aux/config.guess + '[' -f /usr/lib/rpm/redhat/config.guess ']' + /usr/bin/rm -f ./build-aux/config.guess ++ basename ./build-aux/config.guess + /usr/bin/cp -fv /usr/lib/rpm/redhat/config.guess ./build-aux/config.guess '/usr/lib/rpm/redhat/config.guess' -> './build-aux/config.guess' + '[' 1 = 1 ']' + '[' x '!=' 'x-Wl,-z,now -specs=/usr/lib/rpm/redhat/redhat-hardened-ld' ']' ++ find . -name ltmain.sh + for i in $(find . -name ltmain.sh) + /usr/bin/sed -i.backup -e 's~compiler_flags=$~compiler_flags="-Wl,-z,now -specs=/usr/lib/rpm/redhat/redhat-hardened-ld"~' ./build-aux/ltmain.sh ++ grep -q runstatedir=DIR ./configure ++ echo --runstatedir=/run + ./configure --build=riscv64-koji-linux-gnu --host=riscv64-koji-linux-gnu --program-prefix= --disable-dependency-tracking --prefix=/usr --exec-prefix=/usr --bindir=/usr/bin --sbindir=/usr/sbin --sysconfdir=/etc --datadir=/usr/share --includedir=/usr/include --libdir=/usr/lib64 --libexecdir=/usr/libexec --localstatedir=/var --runstatedir=/run --sharedstatedir=/var/lib --mandir=/usr/share/man --infodir=/usr/share/info checking for a BSD-compatible install... /usr/bin/install -c checking whether build environment is sane... yes checking for a race-free mkdir -p... /usr/bin/mkdir -p checking for gawk... gawk checking whether make sets $(MAKE)... yes checking whether make supports nested variables... yes checking whether make supports nested variables... (cached) yes checking build system type... riscv64-koji-linux-gnu checking host system type... riscv64-koji-linux-gnu checking how to print strings... printf checking whether make supports the include directive... yes (GNU style) checking for riscv64-koji-linux-gnu-gcc... gcc checking whether the C compiler works... yes checking for C compiler default output file name... a.out checking for suffix of executables... checking whether we are cross compiling... no checking for suffix of object files... o checking whether the compiler supports GNU C... yes checking whether gcc accepts -g... yes checking for gcc option to enable C11 features... none needed checking whether gcc understands -c and -o together... yes checking dependency style of gcc... none checking for a sed that does not truncate output... /usr/bin/sed checking for grep that handles long lines and -e... /usr/bin/grep checking for egrep... /usr/bin/grep -E checking for fgrep... /usr/bin/grep -F checking for ld used by gcc... /usr/bin/ld checking if the linker (/usr/bin/ld) is GNU ld... yes checking for BSD- or MS-compatible name lister (nm)... /usr/bin/nm -B checking the name lister (/usr/bin/nm -B) interface... BSD nm checking whether ln -s works... yes checking the maximum length of command line arguments... 1572864 checking how to convert riscv64-koji-linux-gnu file names to riscv64-koji-linux-gnu format... func_convert_file_noop checking how to convert riscv64-koji-linux-gnu file names to toolchain format... func_convert_file_noop checking for /usr/bin/ld option to reload object files... -r checking for riscv64-koji-linux-gnu-file... no checking for file... file checking for riscv64-koji-linux-gnu-objdump... no checking for objdump... objdump checking how to recognize dependent libraries... pass_all checking for riscv64-koji-linux-gnu-dlltool... no checking for dlltool... no checking how to associate runtime and link libraries... printf %s\n checking for riscv64-koji-linux-gnu-ar... no checking for ar... ar checking for archiver @FILE support... @ checking for riscv64-koji-linux-gnu-strip... no checking for strip... strip checking for riscv64-koji-linux-gnu-ranlib... no checking for ranlib... ranlib checking command to parse /usr/bin/nm -B output from gcc object... ./configure: line 7052: -e 's/^T .* \(.*\)$/extern int \1();/p' -e 's/^[ABCDGIRSTW][ABCDGIRSTW]* .* \(.*\)$/extern char \1;/p': No such file or directory ok checking for sysroot... no checking for a working dd... /usr/bin/dd checking how to truncate binary pipes... /usr/bin/dd bs=4096 count=1 checking for riscv64-koji-linux-gnu-mt... no checking for mt... no checking if : is a manifest tool... no checking for stdio.h... yes checking for stdlib.h... yes checking for string.h... yes checking for inttypes.h... yes checking for stdint.h... yes checking for strings.h... yes checking for sys/stat.h... yes checking for sys/types.h... yes checking for unistd.h... yes checking for dlfcn.h... yes checking for objdir... .libs checking if gcc supports -fno-rtti -fno-exceptions... no checking for gcc option to produce PIC... -fPIC -DPIC checking if gcc PIC flag -fPIC -DPIC works... yes checking if gcc static flag -static works... no checking if gcc supports -c -o file.o... yes checking if gcc supports -c -o file.o... (cached) yes checking whether the gcc linker (/usr/bin/ld) supports shared libraries... yes checking whether -lc should be explicitly linked in... no checking dynamic linker characteristics... GNU/Linux ld.so checking how to hardcode library paths into programs... immediate checking for shl_load... no checking for shl_load in -ldld... no checking for dlopen... yes checking whether a program can dlopen itself... yes checking whether a statically linked program can dlopen itself... yes checking whether stripping libraries is possible... yes checking if libtool supports shared libraries... yes checking whether to build shared libraries... yes checking whether to build static libraries... no checking for the pthreads library -lpthreads... no checking whether pthreads work without any flags... yes checking for joinable pthread attribute... PTHREAD_CREATE_JOINABLE checking if more special flags are required for pthreads... no checking whether to build with code coverage support... no checking for rst2man... rst2man checking for riscv64-koji-linux-gnu-pkg-config... no checking for pkg-config... /usr/bin/pkg-config checking pkg-config is at least version 0.9.0... yes checking for riscv64-koji-linux-gnu-pkg-config... /usr/bin/pkg-config checking pkg-config is at least version 0.21... yes checking for VARNISHAPI... yes checking for Varnish... 7.2.1 checking for vsha256.h... yes checking for cache/cache.h... yes checking for a Python interpreter with version >= 3.4... python3 checking for python3... /usr/bin/python3 checking for python3 version... 3.11 checking for python3 platform... linux checking for GNU default python3 prefix... ${prefix} checking for GNU default python3 exec_prefix... ${exec_prefix} checking for python3 script directory (pythondir)... ${PYTHON_PREFIX}/lib/python3.11/site-packages checking for python3 extension module directory (pyexecdir)... ${PYTHON_EXEC_PREFIX}/lib64/python3.11/site-packages checking how to run the C preprocessor... gcc -E checking for cache/cache_varnishd.h... yes checking for struct tcp_info... yes checking that generated files are newer than configure... done configure: creating ./config.status config.status: creating Makefile config.status: creating src/Makefile config.status: creating config.h config.status: executing depfiles commands config.status: executing libtool commands + /usr/bin/make -O -j8 V=1 VERBOSE=1 /usr/bin/make all-recursive Making all in src make[2]: Entering directory '/builddir/build/BUILD/varnish-modules-0.21.0/src' /usr/bin/python3 /usr/share/varnish/vmodtool.py -o vcc_accept_if ./vmod_accept.vcc NOTICE: Please put $Module description in quotes. make[2]: Leaving directory '/builddir/build/BUILD/varnish-modules-0.21.0/src' make[2]: Entering directory '/builddir/build/BUILD/varnish-modules-0.21.0/src' /usr/bin/python3 /usr/share/varnish/vmodtool.py -o vcc_saintmode_if ./vmod_saintmode.vcc make[2]: Leaving directory '/builddir/build/BUILD/varnish-modules-0.21.0/src' make[2]: Entering directory '/builddir/build/BUILD/varnish-modules-0.21.0/src' /usr/bin/python3 /usr/share/varnish/vmodtool.py -o vcc_bodyaccess_if ./vmod_bodyaccess.vcc make[2]: Leaving directory '/builddir/build/BUILD/varnish-modules-0.21.0/src' make[2]: Entering directory '/builddir/build/BUILD/varnish-modules-0.21.0/src' /usr/bin/python3 /usr/share/varnish/vmodtool.py -o vcc_tcp_if ./vmod_tcp.vcc make[2]: Leaving directory '/builddir/build/BUILD/varnish-modules-0.21.0/src' make[2]: Entering directory '/builddir/build/BUILD/varnish-modules-0.21.0/src' /usr/bin/python3 /usr/share/varnish/vmodtool.py -o vcc_vsthrottle_if ./vmod_vsthrottle.vcc make[2]: Leaving directory '/builddir/build/BUILD/varnish-modules-0.21.0/src' make[2]: Entering directory '/builddir/build/BUILD/varnish-modules-0.21.0/src' /usr/bin/python3 /usr/share/varnish/vmodtool.py -o vcc_var_if ./vmod_var.vcc make[2]: Leaving directory '/builddir/build/BUILD/varnish-modules-0.21.0/src' make[2]: Entering directory '/builddir/build/BUILD/varnish-modules-0.21.0/src' /usr/bin/python3 /usr/share/varnish/vmodtool.py -o vcc_header_if ./vmod_header.vcc make[2]: Leaving directory '/builddir/build/BUILD/varnish-modules-0.21.0/src' make[2]: Entering directory '/builddir/build/BUILD/varnish-modules-0.21.0/src' /usr/bin/python3 /usr/share/varnish/vmodtool.py -o vcc_str_if ./vmod_str.vcc make[2]: Leaving directory '/builddir/build/BUILD/varnish-modules-0.21.0/src' make[2]: Entering directory '/builddir/build/BUILD/varnish-modules-0.21.0/src' /usr/bin/python3 /usr/share/varnish/vsctool.py -c ./xkey.vsc make[2]: Leaving directory '/builddir/build/BUILD/varnish-modules-0.21.0/src' make[2]: Entering directory '/builddir/build/BUILD/varnish-modules-0.21.0/src' /usr/bin/python3 /usr/share/varnish/vsctool.py -h ./xkey.vsc make[2]: Leaving directory '/builddir/build/BUILD/varnish-modules-0.21.0/src' make[2]: Entering directory '/builddir/build/BUILD/varnish-modules-0.21.0/src' /usr/bin/python3 /usr/share/varnish/vmodtool.py -o vcc_xkey_if ./vmod_xkey.vcc make[2]: Leaving directory '/builddir/build/BUILD/varnish-modules-0.21.0/src' make[2]: Entering directory '/builddir/build/BUILD/varnish-modules-0.21.0/src' /usr/bin/python3 /usr/share/varnish/vsctool.py -r ./xkey.vsc >VSC_xkey.rst make[2]: Leaving directory '/builddir/build/BUILD/varnish-modules-0.21.0/src' make[2]: Entering directory '/builddir/build/BUILD/varnish-modules-0.21.0/src' rst2man vmod_accept.man.rst vmod_accept.3 make[2]: Leaving directory '/builddir/build/BUILD/varnish-modules-0.21.0/src' make[2]: Entering directory '/builddir/build/BUILD/varnish-modules-0.21.0/src' rst2man vmod_bodyaccess.man.rst vmod_bodyaccess.3 make[2]: Leaving directory '/builddir/build/BUILD/varnish-modules-0.21.0/src' make[2]: Entering directory '/builddir/build/BUILD/varnish-modules-0.21.0/src' rst2man vmod_tcp.man.rst vmod_tcp.3 make[2]: Leaving directory '/builddir/build/BUILD/varnish-modules-0.21.0/src' make[2]: Entering directory '/builddir/build/BUILD/varnish-modules-0.21.0/src' rst2man vmod_saintmode.man.rst vmod_saintmode.3 make[2]: Leaving directory '/builddir/build/BUILD/varnish-modules-0.21.0/src' make[2]: Entering directory '/builddir/build/BUILD/varnish-modules-0.21.0/src' rst2man vmod_var.man.rst vmod_var.3 make[2]: Leaving directory '/builddir/build/BUILD/varnish-modules-0.21.0/src' make[2]: Entering directory '/builddir/build/BUILD/varnish-modules-0.21.0/src' rst2man vmod_vsthrottle.man.rst vmod_vsthrottle.3 make[2]: Leaving directory '/builddir/build/BUILD/varnish-modules-0.21.0/src' make[2]: Entering directory '/builddir/build/BUILD/varnish-modules-0.21.0/src' /bin/sh ../libtool --tag=CC --mode=compile gcc -DHAVE_CONFIG_H -I. -I.. -I/usr/include/varnish -I../src/foreign -Wall -Werror -Wall -Wno-format-y2k -Wstrict-prototypes -Wmissing-prototypes -Werror=missing-field-initializers -Wpointer-arith -Wreturn-type -Wwrite-strings -Wcast-qual -Wswitch -Wshadow -Wunused-parameter -Wcast-align -Wchar-subscripts -Wnested-externs -Wextra -Wno-sign-compare -O2 -flto=auto -ffat-lto-objects -fexceptions -g -grecord-gcc-switches -pipe -Wall -Werror=format-security -Wp,-U_FORTIFY_SOURCE,-D_FORTIFY_SOURCE=3 -Wp,-D_GLIBCXX_ASSERTIONS -specs=/usr/lib/rpm/redhat/redhat-hardened-cc1 -fstack-protector-strong -specs=/usr/lib/rpm/redhat/redhat-annobin-cc1 -fasynchronous-unwind-tables -fstack-clash-protection -fno-omit-frame-pointer -c -o vcc_bodyaccess_if.lo vcc_bodyaccess_if.c libtool: compile: gcc -DHAVE_CONFIG_H -I. -I.. -I/usr/include/varnish -I../src/foreign -Wall -Werror -Wall -Wno-format-y2k -Wstrict-prototypes -Wmissing-prototypes -Werror=missing-field-initializers -Wpointer-arith -Wreturn-type -Wwrite-strings -Wcast-qual -Wswitch -Wshadow -Wunused-parameter -Wcast-align -Wchar-subscripts -Wnested-externs -Wextra -Wno-sign-compare -O2 -flto=auto -ffat-lto-objects -fexceptions -g -grecord-gcc-switches -pipe -Wall -Werror=format-security -Wp,-U_FORTIFY_SOURCE,-D_FORTIFY_SOURCE=3 -Wp,-D_GLIBCXX_ASSERTIONS -specs=/usr/lib/rpm/redhat/redhat-hardened-cc1 -fstack-protector-strong -specs=/usr/lib/rpm/redhat/redhat-annobin-cc1 -fasynchronous-unwind-tables -fstack-clash-protection -fno-omit-frame-pointer -c vcc_bodyaccess_if.c -fPIC -DPIC -o .libs/vcc_bodyaccess_if.o make[2]: Leaving directory '/builddir/build/BUILD/varnish-modules-0.21.0/src' make[2]: Entering directory '/builddir/build/BUILD/varnish-modules-0.21.0/src' /bin/sh ../libtool --tag=CC --mode=compile gcc -DHAVE_CONFIG_H -I. -I.. -I/usr/include/varnish -I../src/foreign -Wall -Werror -Wall -Wno-format-y2k -Wstrict-prototypes -Wmissing-prototypes -Werror=missing-field-initializers -Wpointer-arith -Wreturn-type -Wwrite-strings -Wcast-qual -Wswitch -Wshadow -Wunused-parameter -Wcast-align -Wchar-subscripts -Wnested-externs -Wextra -Wno-sign-compare -O2 -flto=auto -ffat-lto-objects -fexceptions -g -grecord-gcc-switches -pipe -Wall -Werror=format-security -Wp,-U_FORTIFY_SOURCE,-D_FORTIFY_SOURCE=3 -Wp,-D_GLIBCXX_ASSERTIONS -specs=/usr/lib/rpm/redhat/redhat-hardened-cc1 -fstack-protector-strong -specs=/usr/lib/rpm/redhat/redhat-annobin-cc1 -fasynchronous-unwind-tables -fstack-clash-protection -fno-omit-frame-pointer -c -o vcc_accept_if.lo vcc_accept_if.c libtool: compile: gcc -DHAVE_CONFIG_H -I. -I.. -I/usr/include/varnish -I../src/foreign -Wall -Werror -Wall -Wno-format-y2k -Wstrict-prototypes -Wmissing-prototypes -Werror=missing-field-initializers -Wpointer-arith -Wreturn-type -Wwrite-strings -Wcast-qual -Wswitch -Wshadow -Wunused-parameter -Wcast-align -Wchar-subscripts -Wnested-externs -Wextra -Wno-sign-compare -O2 -flto=auto -ffat-lto-objects -fexceptions -g -grecord-gcc-switches -pipe -Wall -Werror=format-security -Wp,-U_FORTIFY_SOURCE,-D_FORTIFY_SOURCE=3 -Wp,-D_GLIBCXX_ASSERTIONS -specs=/usr/lib/rpm/redhat/redhat-hardened-cc1 -fstack-protector-strong -specs=/usr/lib/rpm/redhat/redhat-annobin-cc1 -fasynchronous-unwind-tables -fstack-clash-protection -fno-omit-frame-pointer -c vcc_accept_if.c -fPIC -DPIC -o .libs/vcc_accept_if.o make[2]: Leaving directory '/builddir/build/BUILD/varnish-modules-0.21.0/src' make[2]: Entering directory '/builddir/build/BUILD/varnish-modules-0.21.0/src' /bin/sh ../libtool --tag=CC --mode=compile gcc -DHAVE_CONFIG_H -I. -I.. -I/usr/include/varnish -I../src/foreign -Wall -Werror -Wall -Wno-format-y2k -Wstrict-prototypes -Wmissing-prototypes -Werror=missing-field-initializers -Wpointer-arith -Wreturn-type -Wwrite-strings -Wcast-qual -Wswitch -Wshadow -Wunused-parameter -Wcast-align -Wchar-subscripts -Wnested-externs -Wextra -Wno-sign-compare -O2 -flto=auto -ffat-lto-objects -fexceptions -g -grecord-gcc-switches -pipe -Wall -Werror=format-security -Wp,-U_FORTIFY_SOURCE,-D_FORTIFY_SOURCE=3 -Wp,-D_GLIBCXX_ASSERTIONS -specs=/usr/lib/rpm/redhat/redhat-hardened-cc1 -fstack-protector-strong -specs=/usr/lib/rpm/redhat/redhat-annobin-cc1 -fasynchronous-unwind-tables -fstack-clash-protection -fno-omit-frame-pointer -c -o vcc_header_if.lo vcc_header_if.c libtool: compile: gcc -DHAVE_CONFIG_H -I. -I.. -I/usr/include/varnish -I../src/foreign -Wall -Werror -Wall -Wno-format-y2k -Wstrict-prototypes -Wmissing-prototypes -Werror=missing-field-initializers -Wpointer-arith -Wreturn-type -Wwrite-strings -Wcast-qual -Wswitch -Wshadow -Wunused-parameter -Wcast-align -Wchar-subscripts -Wnested-externs -Wextra -Wno-sign-compare -O2 -flto=auto -ffat-lto-objects -fexceptions -g -grecord-gcc-switches -pipe -Wall -Werror=format-security -Wp,-U_FORTIFY_SOURCE,-D_FORTIFY_SOURCE=3 -Wp,-D_GLIBCXX_ASSERTIONS -specs=/usr/lib/rpm/redhat/redhat-hardened-cc1 -fstack-protector-strong -specs=/usr/lib/rpm/redhat/redhat-annobin-cc1 -fasynchronous-unwind-tables -fstack-clash-protection -fno-omit-frame-pointer -c vcc_header_if.c -fPIC -DPIC -o .libs/vcc_header_if.o make[2]: Leaving directory '/builddir/build/BUILD/varnish-modules-0.21.0/src' make[2]: Entering directory '/builddir/build/BUILD/varnish-modules-0.21.0/src' /bin/sh ../libtool --tag=CC --mode=compile gcc -DHAVE_CONFIG_H -I. -I.. -I/usr/include/varnish -I../src/foreign -Wall -Werror -Wall -Wno-format-y2k -Wstrict-prototypes -Wmissing-prototypes -Werror=missing-field-initializers -Wpointer-arith -Wreturn-type -Wwrite-strings -Wcast-qual -Wswitch -Wshadow -Wunused-parameter -Wcast-align -Wchar-subscripts -Wnested-externs -Wextra -Wno-sign-compare -O2 -flto=auto -ffat-lto-objects -fexceptions -g -grecord-gcc-switches -pipe -Wall -Werror=format-security -Wp,-U_FORTIFY_SOURCE,-D_FORTIFY_SOURCE=3 -Wp,-D_GLIBCXX_ASSERTIONS -specs=/usr/lib/rpm/redhat/redhat-hardened-cc1 -fstack-protector-strong -specs=/usr/lib/rpm/redhat/redhat-annobin-cc1 -fasynchronous-unwind-tables -fstack-clash-protection -fno-omit-frame-pointer -c -o vcc_saintmode_if.lo vcc_saintmode_if.c libtool: compile: gcc -DHAVE_CONFIG_H -I. -I.. -I/usr/include/varnish -I../src/foreign -Wall -Werror -Wall -Wno-format-y2k -Wstrict-prototypes -Wmissing-prototypes -Werror=missing-field-initializers -Wpointer-arith -Wreturn-type -Wwrite-strings -Wcast-qual -Wswitch -Wshadow -Wunused-parameter -Wcast-align -Wchar-subscripts -Wnested-externs -Wextra -Wno-sign-compare -O2 -flto=auto -ffat-lto-objects -fexceptions -g -grecord-gcc-switches -pipe -Wall -Werror=format-security -Wp,-U_FORTIFY_SOURCE,-D_FORTIFY_SOURCE=3 -Wp,-D_GLIBCXX_ASSERTIONS -specs=/usr/lib/rpm/redhat/redhat-hardened-cc1 -fstack-protector-strong -specs=/usr/lib/rpm/redhat/redhat-annobin-cc1 -fasynchronous-unwind-tables -fstack-clash-protection -fno-omit-frame-pointer -c vcc_saintmode_if.c -fPIC -DPIC -o .libs/vcc_saintmode_if.o make[2]: Leaving directory '/builddir/build/BUILD/varnish-modules-0.21.0/src' make[2]: Entering directory '/builddir/build/BUILD/varnish-modules-0.21.0/src' /bin/sh ../libtool --tag=CC --mode=compile gcc -DHAVE_CONFIG_H -I. -I.. -I/usr/include/varnish -I../src/foreign -Wall -Werror -Wall -Wno-format-y2k -Wstrict-prototypes -Wmissing-prototypes -Werror=missing-field-initializers -Wpointer-arith -Wreturn-type -Wwrite-strings -Wcast-qual -Wswitch -Wshadow -Wunused-parameter -Wcast-align -Wchar-subscripts -Wnested-externs -Wextra -Wno-sign-compare -O2 -flto=auto -ffat-lto-objects -fexceptions -g -grecord-gcc-switches -pipe -Wall -Werror=format-security -Wp,-U_FORTIFY_SOURCE,-D_FORTIFY_SOURCE=3 -Wp,-D_GLIBCXX_ASSERTIONS -specs=/usr/lib/rpm/redhat/redhat-hardened-cc1 -fstack-protector-strong -specs=/usr/lib/rpm/redhat/redhat-annobin-cc1 -fasynchronous-unwind-tables -fstack-clash-protection -fno-omit-frame-pointer -c -o vcc_str_if.lo vcc_str_if.c libtool: compile: gcc -DHAVE_CONFIG_H -I. -I.. -I/usr/include/varnish -I../src/foreign -Wall -Werror -Wall -Wno-format-y2k -Wstrict-prototypes -Wmissing-prototypes -Werror=missing-field-initializers -Wpointer-arith -Wreturn-type -Wwrite-strings -Wcast-qual -Wswitch -Wshadow -Wunused-parameter -Wcast-align -Wchar-subscripts -Wnested-externs -Wextra -Wno-sign-compare -O2 -flto=auto -ffat-lto-objects -fexceptions -g -grecord-gcc-switches -pipe -Wall -Werror=format-security -Wp,-U_FORTIFY_SOURCE,-D_FORTIFY_SOURCE=3 -Wp,-D_GLIBCXX_ASSERTIONS -specs=/usr/lib/rpm/redhat/redhat-hardened-cc1 -fstack-protector-strong -specs=/usr/lib/rpm/redhat/redhat-annobin-cc1 -fasynchronous-unwind-tables -fstack-clash-protection -fno-omit-frame-pointer -c vcc_str_if.c -fPIC -DPIC -o .libs/vcc_str_if.o make[2]: Leaving directory '/builddir/build/BUILD/varnish-modules-0.21.0/src' make[2]: Entering directory '/builddir/build/BUILD/varnish-modules-0.21.0/src' /bin/sh ../libtool --tag=CC --mode=compile gcc -DHAVE_CONFIG_H -I. -I.. -I/usr/include/varnish -I../src/foreign -Wall -Werror -Wall -Wno-format-y2k -Wstrict-prototypes -Wmissing-prototypes -Werror=missing-field-initializers -Wpointer-arith -Wreturn-type -Wwrite-strings -Wcast-qual -Wswitch -Wshadow -Wunused-parameter -Wcast-align -Wchar-subscripts -Wnested-externs -Wextra -Wno-sign-compare -O2 -flto=auto -ffat-lto-objects -fexceptions -g -grecord-gcc-switches -pipe -Wall -Werror=format-security -Wp,-U_FORTIFY_SOURCE,-D_FORTIFY_SOURCE=3 -Wp,-D_GLIBCXX_ASSERTIONS -specs=/usr/lib/rpm/redhat/redhat-hardened-cc1 -fstack-protector-strong -specs=/usr/lib/rpm/redhat/redhat-annobin-cc1 -fasynchronous-unwind-tables -fstack-clash-protection -fno-omit-frame-pointer -c -o vmod_bodyaccess.lo vmod_bodyaccess.c libtool: compile: gcc -DHAVE_CONFIG_H -I. -I.. -I/usr/include/varnish -I../src/foreign -Wall -Werror -Wall -Wno-format-y2k -Wstrict-prototypes -Wmissing-prototypes -Werror=missing-field-initializers -Wpointer-arith -Wreturn-type -Wwrite-strings -Wcast-qual -Wswitch -Wshadow -Wunused-parameter -Wcast-align -Wchar-subscripts -Wnested-externs -Wextra -Wno-sign-compare -O2 -flto=auto -ffat-lto-objects -fexceptions -g -grecord-gcc-switches -pipe -Wall -Werror=format-security -Wp,-U_FORTIFY_SOURCE,-D_FORTIFY_SOURCE=3 -Wp,-D_GLIBCXX_ASSERTIONS -specs=/usr/lib/rpm/redhat/redhat-hardened-cc1 -fstack-protector-strong -specs=/usr/lib/rpm/redhat/redhat-annobin-cc1 -fasynchronous-unwind-tables -fstack-clash-protection -fno-omit-frame-pointer -c vmod_bodyaccess.c -fPIC -DPIC -o .libs/vmod_bodyaccess.o make[2]: Leaving directory '/builddir/build/BUILD/varnish-modules-0.21.0/src' make[2]: Entering directory '/builddir/build/BUILD/varnish-modules-0.21.0/src' /bin/sh ../libtool --tag=CC --mode=compile gcc -DHAVE_CONFIG_H -I. -I.. -I/usr/include/varnish -I../src/foreign -Wall -Werror -Wall -Wno-format-y2k -Wstrict-prototypes -Wmissing-prototypes -Werror=missing-field-initializers -Wpointer-arith -Wreturn-type -Wwrite-strings -Wcast-qual -Wswitch -Wshadow -Wunused-parameter -Wcast-align -Wchar-subscripts -Wnested-externs -Wextra -Wno-sign-compare -O2 -flto=auto -ffat-lto-objects -fexceptions -g -grecord-gcc-switches -pipe -Wall -Werror=format-security -Wp,-U_FORTIFY_SOURCE,-D_FORTIFY_SOURCE=3 -Wp,-D_GLIBCXX_ASSERTIONS -specs=/usr/lib/rpm/redhat/redhat-hardened-cc1 -fstack-protector-strong -specs=/usr/lib/rpm/redhat/redhat-annobin-cc1 -fasynchronous-unwind-tables -fstack-clash-protection -fno-omit-frame-pointer -c -o vmod_header.lo vmod_header.c libtool: compile: gcc -DHAVE_CONFIG_H -I. -I.. -I/usr/include/varnish -I../src/foreign -Wall -Werror -Wall -Wno-format-y2k -Wstrict-prototypes -Wmissing-prototypes -Werror=missing-field-initializers -Wpointer-arith -Wreturn-type -Wwrite-strings -Wcast-qual -Wswitch -Wshadow -Wunused-parameter -Wcast-align -Wchar-subscripts -Wnested-externs -Wextra -Wno-sign-compare -O2 -flto=auto -ffat-lto-objects -fexceptions -g -grecord-gcc-switches -pipe -Wall -Werror=format-security -Wp,-U_FORTIFY_SOURCE,-D_FORTIFY_SOURCE=3 -Wp,-D_GLIBCXX_ASSERTIONS -specs=/usr/lib/rpm/redhat/redhat-hardened-cc1 -fstack-protector-strong -specs=/usr/lib/rpm/redhat/redhat-annobin-cc1 -fasynchronous-unwind-tables -fstack-clash-protection -fno-omit-frame-pointer -c vmod_header.c -fPIC -DPIC -o .libs/vmod_header.o make[2]: Leaving directory '/builddir/build/BUILD/varnish-modules-0.21.0/src' make[2]: Entering directory '/builddir/build/BUILD/varnish-modules-0.21.0/src' /bin/sh ../libtool --tag=CC --mode=compile gcc -DHAVE_CONFIG_H -I. -I.. -I/usr/include/varnish -I../src/foreign -Wall -Werror -Wall -Wno-format-y2k -Wstrict-prototypes -Wmissing-prototypes -Werror=missing-field-initializers -Wpointer-arith -Wreturn-type -Wwrite-strings -Wcast-qual -Wswitch -Wshadow -Wunused-parameter -Wcast-align -Wchar-subscripts -Wnested-externs -Wextra -Wno-sign-compare -O2 -flto=auto -ffat-lto-objects -fexceptions -g -grecord-gcc-switches -pipe -Wall -Werror=format-security -Wp,-U_FORTIFY_SOURCE,-D_FORTIFY_SOURCE=3 -Wp,-D_GLIBCXX_ASSERTIONS -specs=/usr/lib/rpm/redhat/redhat-hardened-cc1 -fstack-protector-strong -specs=/usr/lib/rpm/redhat/redhat-annobin-cc1 -fasynchronous-unwind-tables -fstack-clash-protection -fno-omit-frame-pointer -c -o vmod_accept.lo vmod_accept.c libtool: compile: gcc -DHAVE_CONFIG_H -I. -I.. -I/usr/include/varnish -I../src/foreign -Wall -Werror -Wall -Wno-format-y2k -Wstrict-prototypes -Wmissing-prototypes -Werror=missing-field-initializers -Wpointer-arith -Wreturn-type -Wwrite-strings -Wcast-qual -Wswitch -Wshadow -Wunused-parameter -Wcast-align -Wchar-subscripts -Wnested-externs -Wextra -Wno-sign-compare -O2 -flto=auto -ffat-lto-objects -fexceptions -g -grecord-gcc-switches -pipe -Wall -Werror=format-security -Wp,-U_FORTIFY_SOURCE,-D_FORTIFY_SOURCE=3 -Wp,-D_GLIBCXX_ASSERTIONS -specs=/usr/lib/rpm/redhat/redhat-hardened-cc1 -fstack-protector-strong -specs=/usr/lib/rpm/redhat/redhat-annobin-cc1 -fasynchronous-unwind-tables -fstack-clash-protection -fno-omit-frame-pointer -c vmod_accept.c -fPIC -DPIC -o .libs/vmod_accept.o make[2]: Leaving directory '/builddir/build/BUILD/varnish-modules-0.21.0/src' make[2]: Entering directory '/builddir/build/BUILD/varnish-modules-0.21.0/src' /bin/sh ../libtool --tag=CC --mode=compile gcc -DHAVE_CONFIG_H -I. -I.. -I/usr/include/varnish -I../src/foreign -Wall -Werror -Wall -Wno-format-y2k -Wstrict-prototypes -Wmissing-prototypes -Werror=missing-field-initializers -Wpointer-arith -Wreturn-type -Wwrite-strings -Wcast-qual -Wswitch -Wshadow -Wunused-parameter -Wcast-align -Wchar-subscripts -Wnested-externs -Wextra -Wno-sign-compare -O2 -flto=auto -ffat-lto-objects -fexceptions -g -grecord-gcc-switches -pipe -Wall -Werror=format-security -Wp,-U_FORTIFY_SOURCE,-D_FORTIFY_SOURCE=3 -Wp,-D_GLIBCXX_ASSERTIONS -specs=/usr/lib/rpm/redhat/redhat-hardened-cc1 -fstack-protector-strong -specs=/usr/lib/rpm/redhat/redhat-annobin-cc1 -fasynchronous-unwind-tables -fstack-clash-protection -fno-omit-frame-pointer -c -o vcc_tcp_if.lo vcc_tcp_if.c libtool: compile: gcc -DHAVE_CONFIG_H -I. -I.. -I/usr/include/varnish -I../src/foreign -Wall -Werror -Wall -Wno-format-y2k -Wstrict-prototypes -Wmissing-prototypes -Werror=missing-field-initializers -Wpointer-arith -Wreturn-type -Wwrite-strings -Wcast-qual -Wswitch -Wshadow -Wunused-parameter -Wcast-align -Wchar-subscripts -Wnested-externs -Wextra -Wno-sign-compare -O2 -flto=auto -ffat-lto-objects -fexceptions -g -grecord-gcc-switches -pipe -Wall -Werror=format-security -Wp,-U_FORTIFY_SOURCE,-D_FORTIFY_SOURCE=3 -Wp,-D_GLIBCXX_ASSERTIONS -specs=/usr/lib/rpm/redhat/redhat-hardened-cc1 -fstack-protector-strong -specs=/usr/lib/rpm/redhat/redhat-annobin-cc1 -fasynchronous-unwind-tables -fstack-clash-protection -fno-omit-frame-pointer -c vcc_tcp_if.c -fPIC -DPIC -o .libs/vcc_tcp_if.o make[2]: Leaving directory '/builddir/build/BUILD/varnish-modules-0.21.0/src' make[2]: Entering directory '/builddir/build/BUILD/varnish-modules-0.21.0/src' /bin/sh ../libtool --tag=CC --mode=compile gcc -DHAVE_CONFIG_H -I. -I.. -I/usr/include/varnish -I../src/foreign -Wall -Werror -Wall -Wno-format-y2k -Wstrict-prototypes -Wmissing-prototypes -Werror=missing-field-initializers -Wpointer-arith -Wreturn-type -Wwrite-strings -Wcast-qual -Wswitch -Wshadow -Wunused-parameter -Wcast-align -Wchar-subscripts -Wnested-externs -Wextra -Wno-sign-compare -O2 -flto=auto -ffat-lto-objects -fexceptions -g -grecord-gcc-switches -pipe -Wall -Werror=format-security -Wp,-U_FORTIFY_SOURCE,-D_FORTIFY_SOURCE=3 -Wp,-D_GLIBCXX_ASSERTIONS -specs=/usr/lib/rpm/redhat/redhat-hardened-cc1 -fstack-protector-strong -specs=/usr/lib/rpm/redhat/redhat-annobin-cc1 -fasynchronous-unwind-tables -fstack-clash-protection -fno-omit-frame-pointer -c -o vmod_saintmode.lo vmod_saintmode.c libtool: compile: gcc -DHAVE_CONFIG_H -I. -I.. -I/usr/include/varnish -I../src/foreign -Wall -Werror -Wall -Wno-format-y2k -Wstrict-prototypes -Wmissing-prototypes -Werror=missing-field-initializers -Wpointer-arith -Wreturn-type -Wwrite-strings -Wcast-qual -Wswitch -Wshadow -Wunused-parameter -Wcast-align -Wchar-subscripts -Wnested-externs -Wextra -Wno-sign-compare -O2 -flto=auto -ffat-lto-objects -fexceptions -g -grecord-gcc-switches -pipe -Wall -Werror=format-security -Wp,-U_FORTIFY_SOURCE,-D_FORTIFY_SOURCE=3 -Wp,-D_GLIBCXX_ASSERTIONS -specs=/usr/lib/rpm/redhat/redhat-hardened-cc1 -fstack-protector-strong -specs=/usr/lib/rpm/redhat/redhat-annobin-cc1 -fasynchronous-unwind-tables -fstack-clash-protection -fno-omit-frame-pointer -c vmod_saintmode.c -fPIC -DPIC -o .libs/vmod_saintmode.o make[2]: Leaving directory '/builddir/build/BUILD/varnish-modules-0.21.0/src' make[2]: Entering directory '/builddir/build/BUILD/varnish-modules-0.21.0/src' /bin/sh ../libtool --tag=CC --mode=compile gcc -DHAVE_CONFIG_H -I. -I.. -I/usr/include/varnish -I../src/foreign -Wall -Werror -Wall -Wno-format-y2k -Wstrict-prototypes -Wmissing-prototypes -Werror=missing-field-initializers -Wpointer-arith -Wreturn-type -Wwrite-strings -Wcast-qual -Wswitch -Wshadow -Wunused-parameter -Wcast-align -Wchar-subscripts -Wnested-externs -Wextra -Wno-sign-compare -O2 -flto=auto -ffat-lto-objects -fexceptions -g -grecord-gcc-switches -pipe -Wall -Werror=format-security -Wp,-U_FORTIFY_SOURCE,-D_FORTIFY_SOURCE=3 -Wp,-D_GLIBCXX_ASSERTIONS -specs=/usr/lib/rpm/redhat/redhat-hardened-cc1 -fstack-protector-strong -specs=/usr/lib/rpm/redhat/redhat-annobin-cc1 -fasynchronous-unwind-tables -fstack-clash-protection -fno-omit-frame-pointer -c -o vmod_tcp.lo vmod_tcp.c libtool: compile: gcc -DHAVE_CONFIG_H -I. -I.. -I/usr/include/varnish -I../src/foreign -Wall -Werror -Wall -Wno-format-y2k -Wstrict-prototypes -Wmissing-prototypes -Werror=missing-field-initializers -Wpointer-arith -Wreturn-type -Wwrite-strings -Wcast-qual -Wswitch -Wshadow -Wunused-parameter -Wcast-align -Wchar-subscripts -Wnested-externs -Wextra -Wno-sign-compare -O2 -flto=auto -ffat-lto-objects -fexceptions -g -grecord-gcc-switches -pipe -Wall -Werror=format-security -Wp,-U_FORTIFY_SOURCE,-D_FORTIFY_SOURCE=3 -Wp,-D_GLIBCXX_ASSERTIONS -specs=/usr/lib/rpm/redhat/redhat-hardened-cc1 -fstack-protector-strong -specs=/usr/lib/rpm/redhat/redhat-annobin-cc1 -fasynchronous-unwind-tables -fstack-clash-protection -fno-omit-frame-pointer -c vmod_tcp.c -fPIC -DPIC -o .libs/vmod_tcp.o make[2]: Leaving directory '/builddir/build/BUILD/varnish-modules-0.21.0/src' make[2]: Entering directory '/builddir/build/BUILD/varnish-modules-0.21.0/src' /bin/sh ../libtool --tag=CC --mode=compile gcc -DHAVE_CONFIG_H -I. -I.. -I/usr/include/varnish -I../src/foreign -Wall -Werror -Wall -Wno-format-y2k -Wstrict-prototypes -Wmissing-prototypes -Werror=missing-field-initializers -Wpointer-arith -Wreturn-type -Wwrite-strings -Wcast-qual -Wswitch -Wshadow -Wunused-parameter -Wcast-align -Wchar-subscripts -Wnested-externs -Wextra -Wno-sign-compare -O2 -flto=auto -ffat-lto-objects -fexceptions -g -grecord-gcc-switches -pipe -Wall -Werror=format-security -Wp,-U_FORTIFY_SOURCE,-D_FORTIFY_SOURCE=3 -Wp,-D_GLIBCXX_ASSERTIONS -specs=/usr/lib/rpm/redhat/redhat-hardened-cc1 -fstack-protector-strong -specs=/usr/lib/rpm/redhat/redhat-annobin-cc1 -fasynchronous-unwind-tables -fstack-clash-protection -fno-omit-frame-pointer -c -o vmod_str.lo vmod_str.c libtool: compile: gcc -DHAVE_CONFIG_H -I. -I.. -I/usr/include/varnish -I../src/foreign -Wall -Werror -Wall -Wno-format-y2k -Wstrict-prototypes -Wmissing-prototypes -Werror=missing-field-initializers -Wpointer-arith -Wreturn-type -Wwrite-strings -Wcast-qual -Wswitch -Wshadow -Wunused-parameter -Wcast-align -Wchar-subscripts -Wnested-externs -Wextra -Wno-sign-compare -O2 -flto=auto -ffat-lto-objects -fexceptions -g -grecord-gcc-switches -pipe -Wall -Werror=format-security -Wp,-U_FORTIFY_SOURCE,-D_FORTIFY_SOURCE=3 -Wp,-D_GLIBCXX_ASSERTIONS -specs=/usr/lib/rpm/redhat/redhat-hardened-cc1 -fstack-protector-strong -specs=/usr/lib/rpm/redhat/redhat-annobin-cc1 -fasynchronous-unwind-tables -fstack-clash-protection -fno-omit-frame-pointer -c vmod_str.c -fPIC -DPIC -o .libs/vmod_str.o make[2]: Leaving directory '/builddir/build/BUILD/varnish-modules-0.21.0/src' make[2]: Entering directory '/builddir/build/BUILD/varnish-modules-0.21.0/src' /bin/sh ../libtool --tag=CC --mode=compile gcc -DHAVE_CONFIG_H -I. -I.. -I/usr/include/varnish -I../src/foreign -Wall -Werror -Wall -Wno-format-y2k -Wstrict-prototypes -Wmissing-prototypes -Werror=missing-field-initializers -Wpointer-arith -Wreturn-type -Wwrite-strings -Wcast-qual -Wswitch -Wshadow -Wunused-parameter -Wcast-align -Wchar-subscripts -Wnested-externs -Wextra -Wno-sign-compare -O2 -flto=auto -ffat-lto-objects -fexceptions -g -grecord-gcc-switches -pipe -Wall -Werror=format-security -Wp,-U_FORTIFY_SOURCE,-D_FORTIFY_SOURCE=3 -Wp,-D_GLIBCXX_ASSERTIONS -specs=/usr/lib/rpm/redhat/redhat-hardened-cc1 -fstack-protector-strong -specs=/usr/lib/rpm/redhat/redhat-annobin-cc1 -fasynchronous-unwind-tables -fstack-clash-protection -fno-omit-frame-pointer -c -o vcc_vsthrottle_if.lo vcc_vsthrottle_if.c libtool: compile: gcc -DHAVE_CONFIG_H -I. -I.. -I/usr/include/varnish -I../src/foreign -Wall -Werror -Wall -Wno-format-y2k -Wstrict-prototypes -Wmissing-prototypes -Werror=missing-field-initializers -Wpointer-arith -Wreturn-type -Wwrite-strings -Wcast-qual -Wswitch -Wshadow -Wunused-parameter -Wcast-align -Wchar-subscripts -Wnested-externs -Wextra -Wno-sign-compare -O2 -flto=auto -ffat-lto-objects -fexceptions -g -grecord-gcc-switches -pipe -Wall -Werror=format-security -Wp,-U_FORTIFY_SOURCE,-D_FORTIFY_SOURCE=3 -Wp,-D_GLIBCXX_ASSERTIONS -specs=/usr/lib/rpm/redhat/redhat-hardened-cc1 -fstack-protector-strong -specs=/usr/lib/rpm/redhat/redhat-annobin-cc1 -fasynchronous-unwind-tables -fstack-clash-protection -fno-omit-frame-pointer -c vcc_vsthrottle_if.c -fPIC -DPIC -o .libs/vcc_vsthrottle_if.o make[2]: Leaving directory '/builddir/build/BUILD/varnish-modules-0.21.0/src' make[2]: Entering directory '/builddir/build/BUILD/varnish-modules-0.21.0/src' /bin/sh ../libtool --tag=CC --mode=compile gcc -DHAVE_CONFIG_H -I. -I.. -I/usr/include/varnish -I../src/foreign -Wall -Werror -Wall -Wno-format-y2k -Wstrict-prototypes -Wmissing-prototypes -Werror=missing-field-initializers -Wpointer-arith -Wreturn-type -Wwrite-strings -Wcast-qual -Wswitch -Wshadow -Wunused-parameter -Wcast-align -Wchar-subscripts -Wnested-externs -Wextra -Wno-sign-compare -O2 -flto=auto -ffat-lto-objects -fexceptions -g -grecord-gcc-switches -pipe -Wall -Werror=format-security -Wp,-U_FORTIFY_SOURCE,-D_FORTIFY_SOURCE=3 -Wp,-D_GLIBCXX_ASSERTIONS -specs=/usr/lib/rpm/redhat/redhat-hardened-cc1 -fstack-protector-strong -specs=/usr/lib/rpm/redhat/redhat-annobin-cc1 -fasynchronous-unwind-tables -fstack-clash-protection -fno-omit-frame-pointer -c -o vcc_var_if.lo vcc_var_if.c libtool: compile: gcc -DHAVE_CONFIG_H -I. -I.. -I/usr/include/varnish -I../src/foreign -Wall -Werror -Wall -Wno-format-y2k -Wstrict-prototypes -Wmissing-prototypes -Werror=missing-field-initializers -Wpointer-arith -Wreturn-type -Wwrite-strings -Wcast-qual -Wswitch -Wshadow -Wunused-parameter -Wcast-align -Wchar-subscripts -Wnested-externs -Wextra -Wno-sign-compare -O2 -flto=auto -ffat-lto-objects -fexceptions -g -grecord-gcc-switches -pipe -Wall -Werror=format-security -Wp,-U_FORTIFY_SOURCE,-D_FORTIFY_SOURCE=3 -Wp,-D_GLIBCXX_ASSERTIONS -specs=/usr/lib/rpm/redhat/redhat-hardened-cc1 -fstack-protector-strong -specs=/usr/lib/rpm/redhat/redhat-annobin-cc1 -fasynchronous-unwind-tables -fstack-clash-protection -fno-omit-frame-pointer -c vcc_var_if.c -fPIC -DPIC -o .libs/vcc_var_if.o make[2]: Leaving directory '/builddir/build/BUILD/varnish-modules-0.21.0/src' make[2]: Entering directory '/builddir/build/BUILD/varnish-modules-0.21.0/src' /bin/sh ../libtool --tag=CC --mode=compile gcc -DHAVE_CONFIG_H -I. -I.. -I/usr/include/varnish -I../src/foreign -Wall -Werror -Wall -Wno-format-y2k -Wstrict-prototypes -Wmissing-prototypes -Werror=missing-field-initializers -Wpointer-arith -Wreturn-type -Wwrite-strings -Wcast-qual -Wswitch -Wshadow -Wunused-parameter -Wcast-align -Wchar-subscripts -Wnested-externs -Wextra -Wno-sign-compare -O2 -flto=auto -ffat-lto-objects -fexceptions -g -grecord-gcc-switches -pipe -Wall -Werror=format-security -Wp,-U_FORTIFY_SOURCE,-D_FORTIFY_SOURCE=3 -Wp,-D_GLIBCXX_ASSERTIONS -specs=/usr/lib/rpm/redhat/redhat-hardened-cc1 -fstack-protector-strong -specs=/usr/lib/rpm/redhat/redhat-annobin-cc1 -fasynchronous-unwind-tables -fstack-clash-protection -fno-omit-frame-pointer -c -o vcc_xkey_if.lo vcc_xkey_if.c libtool: compile: gcc -DHAVE_CONFIG_H -I. -I.. -I/usr/include/varnish -I../src/foreign -Wall -Werror -Wall -Wno-format-y2k -Wstrict-prototypes -Wmissing-prototypes -Werror=missing-field-initializers -Wpointer-arith -Wreturn-type -Wwrite-strings -Wcast-qual -Wswitch -Wshadow -Wunused-parameter -Wcast-align -Wchar-subscripts -Wnested-externs -Wextra -Wno-sign-compare -O2 -flto=auto -ffat-lto-objects -fexceptions -g -grecord-gcc-switches -pipe -Wall -Werror=format-security -Wp,-U_FORTIFY_SOURCE,-D_FORTIFY_SOURCE=3 -Wp,-D_GLIBCXX_ASSERTIONS -specs=/usr/lib/rpm/redhat/redhat-hardened-cc1 -fstack-protector-strong -specs=/usr/lib/rpm/redhat/redhat-annobin-cc1 -fasynchronous-unwind-tables -fstack-clash-protection -fno-omit-frame-pointer -c vcc_xkey_if.c -fPIC -DPIC -o .libs/vcc_xkey_if.o make[2]: Leaving directory '/builddir/build/BUILD/varnish-modules-0.21.0/src' make[2]: Entering directory '/builddir/build/BUILD/varnish-modules-0.21.0/src' rst2man vmod_header.man.rst vmod_header.3 make[2]: Leaving directory '/builddir/build/BUILD/varnish-modules-0.21.0/src' make[2]: Entering directory '/builddir/build/BUILD/varnish-modules-0.21.0/src' rst2man vmod_str.man.rst vmod_str.3 make[2]: Leaving directory '/builddir/build/BUILD/varnish-modules-0.21.0/src' make[2]: Entering directory '/builddir/build/BUILD/varnish-modules-0.21.0/src' /bin/sh ../libtool --tag=CC --mode=compile gcc -DHAVE_CONFIG_H -I. -I.. -I/usr/include/varnish -I../src/foreign -Wall -Werror -Wall -Wno-format-y2k -Wstrict-prototypes -Wmissing-prototypes -Werror=missing-field-initializers -Wpointer-arith -Wreturn-type -Wwrite-strings -Wcast-qual -Wswitch -Wshadow -Wunused-parameter -Wcast-align -Wchar-subscripts -Wnested-externs -Wextra -Wno-sign-compare -O2 -flto=auto -ffat-lto-objects -fexceptions -g -grecord-gcc-switches -pipe -Wall -Werror=format-security -Wp,-U_FORTIFY_SOURCE,-D_FORTIFY_SOURCE=3 -Wp,-D_GLIBCXX_ASSERTIONS -specs=/usr/lib/rpm/redhat/redhat-hardened-cc1 -fstack-protector-strong -specs=/usr/lib/rpm/redhat/redhat-annobin-cc1 -fasynchronous-unwind-tables -fstack-clash-protection -fno-omit-frame-pointer -c -o VSC_xkey.lo VSC_xkey.c libtool: compile: gcc -DHAVE_CONFIG_H -I. -I.. -I/usr/include/varnish -I../src/foreign -Wall -Werror -Wall -Wno-format-y2k -Wstrict-prototypes -Wmissing-prototypes -Werror=missing-field-initializers -Wpointer-arith -Wreturn-type -Wwrite-strings -Wcast-qual -Wswitch -Wshadow -Wunused-parameter -Wcast-align -Wchar-subscripts -Wnested-externs -Wextra -Wno-sign-compare -O2 -flto=auto -ffat-lto-objects -fexceptions -g -grecord-gcc-switches -pipe -Wall -Werror=format-security -Wp,-U_FORTIFY_SOURCE,-D_FORTIFY_SOURCE=3 -Wp,-D_GLIBCXX_ASSERTIONS -specs=/usr/lib/rpm/redhat/redhat-hardened-cc1 -fstack-protector-strong -specs=/usr/lib/rpm/redhat/redhat-annobin-cc1 -fasynchronous-unwind-tables -fstack-clash-protection -fno-omit-frame-pointer -c VSC_xkey.c -fPIC -DPIC -o .libs/VSC_xkey.o make[2]: Leaving directory '/builddir/build/BUILD/varnish-modules-0.21.0/src' make[2]: Entering directory '/builddir/build/BUILD/varnish-modules-0.21.0/src' rst2man vmod_xkey.man.rst vmod_xkey.3 make[2]: Leaving directory '/builddir/build/BUILD/varnish-modules-0.21.0/src' make[2]: Entering directory '/builddir/build/BUILD/varnish-modules-0.21.0/src' /bin/sh ../libtool --tag=CC --mode=compile gcc -DHAVE_CONFIG_H -I. -I.. -I/usr/include/varnish -I../src/foreign -Wall -Werror -Wall -Wno-format-y2k -Wstrict-prototypes -Wmissing-prototypes -Werror=missing-field-initializers -Wpointer-arith -Wreturn-type -Wwrite-strings -Wcast-qual -Wswitch -Wshadow -Wunused-parameter -Wcast-align -Wchar-subscripts -Wnested-externs -Wextra -Wno-sign-compare -O2 -flto=auto -ffat-lto-objects -fexceptions -g -grecord-gcc-switches -pipe -Wall -Werror=format-security -Wp,-U_FORTIFY_SOURCE,-D_FORTIFY_SOURCE=3 -Wp,-D_GLIBCXX_ASSERTIONS -specs=/usr/lib/rpm/redhat/redhat-hardened-cc1 -fstack-protector-strong -specs=/usr/lib/rpm/redhat/redhat-annobin-cc1 -fasynchronous-unwind-tables -fstack-clash-protection -fno-omit-frame-pointer -c -o vmod_var.lo vmod_var.c libtool: compile: gcc -DHAVE_CONFIG_H -I. -I.. -I/usr/include/varnish -I../src/foreign -Wall -Werror -Wall -Wno-format-y2k -Wstrict-prototypes -Wmissing-prototypes -Werror=missing-field-initializers -Wpointer-arith -Wreturn-type -Wwrite-strings -Wcast-qual -Wswitch -Wshadow -Wunused-parameter -Wcast-align -Wchar-subscripts -Wnested-externs -Wextra -Wno-sign-compare -O2 -flto=auto -ffat-lto-objects -fexceptions -g -grecord-gcc-switches -pipe -Wall -Werror=format-security -Wp,-U_FORTIFY_SOURCE,-D_FORTIFY_SOURCE=3 -Wp,-D_GLIBCXX_ASSERTIONS -specs=/usr/lib/rpm/redhat/redhat-hardened-cc1 -fstack-protector-strong -specs=/usr/lib/rpm/redhat/redhat-annobin-cc1 -fasynchronous-unwind-tables -fstack-clash-protection -fno-omit-frame-pointer -c vmod_var.c -fPIC -DPIC -o .libs/vmod_var.o make[2]: Leaving directory '/builddir/build/BUILD/varnish-modules-0.21.0/src' make[2]: Entering directory '/builddir/build/BUILD/varnish-modules-0.21.0/src' /bin/sh ../libtool --tag=CC --mode=compile gcc -DHAVE_CONFIG_H -I. -I.. -I/usr/include/varnish -I../src/foreign -Wall -Werror -Wall -Wno-format-y2k -Wstrict-prototypes -Wmissing-prototypes -Werror=missing-field-initializers -Wpointer-arith -Wreturn-type -Wwrite-strings -Wcast-qual -Wswitch -Wshadow -Wunused-parameter -Wcast-align -Wchar-subscripts -Wnested-externs -Wextra -Wno-sign-compare -O2 -flto=auto -ffat-lto-objects -fexceptions -g -grecord-gcc-switches -pipe -Wall -Werror=format-security -Wp,-U_FORTIFY_SOURCE,-D_FORTIFY_SOURCE=3 -Wp,-D_GLIBCXX_ASSERTIONS -specs=/usr/lib/rpm/redhat/redhat-hardened-cc1 -fstack-protector-strong -specs=/usr/lib/rpm/redhat/redhat-annobin-cc1 -fasynchronous-unwind-tables -fstack-clash-protection -fno-omit-frame-pointer -c -o vmod_vsthrottle.lo vmod_vsthrottle.c libtool: compile: gcc -DHAVE_CONFIG_H -I. -I.. -I/usr/include/varnish -I../src/foreign -Wall -Werror -Wall -Wno-format-y2k -Wstrict-prototypes -Wmissing-prototypes -Werror=missing-field-initializers -Wpointer-arith -Wreturn-type -Wwrite-strings -Wcast-qual -Wswitch -Wshadow -Wunused-parameter -Wcast-align -Wchar-subscripts -Wnested-externs -Wextra -Wno-sign-compare -O2 -flto=auto -ffat-lto-objects -fexceptions -g -grecord-gcc-switches -pipe -Wall -Werror=format-security -Wp,-U_FORTIFY_SOURCE,-D_FORTIFY_SOURCE=3 -Wp,-D_GLIBCXX_ASSERTIONS -specs=/usr/lib/rpm/redhat/redhat-hardened-cc1 -fstack-protector-strong -specs=/usr/lib/rpm/redhat/redhat-annobin-cc1 -fasynchronous-unwind-tables -fstack-clash-protection -fno-omit-frame-pointer -c vmod_vsthrottle.c -fPIC -DPIC -o .libs/vmod_vsthrottle.o make[2]: Leaving directory '/builddir/build/BUILD/varnish-modules-0.21.0/src' make[2]: Entering directory '/builddir/build/BUILD/varnish-modules-0.21.0/src' /bin/sh ../libtool --tag=CC --mode=link gcc -I/usr/include/varnish -I../src/foreign -Wall -Werror -Wall -Wno-format-y2k -Wstrict-prototypes -Wmissing-prototypes -Werror=missing-field-initializers -Wpointer-arith -Wreturn-type -Wwrite-strings -Wcast-qual -Wswitch -Wshadow -Wunused-parameter -Wcast-align -Wchar-subscripts -Wnested-externs -Wextra -Wno-sign-compare -O2 -flto=auto -ffat-lto-objects -fexceptions -g -grecord-gcc-switches -pipe -Wall -Werror=format-security -Wp,-U_FORTIFY_SOURCE,-D_FORTIFY_SOURCE=3 -Wp,-D_GLIBCXX_ASSERTIONS -specs=/usr/lib/rpm/redhat/redhat-hardened-cc1 -fstack-protector-strong -specs=/usr/lib/rpm/redhat/redhat-annobin-cc1 -fasynchronous-unwind-tables -fstack-clash-protection -fno-omit-frame-pointer -lvarnishapi -module -export-dynamic -avoid-version -shared -Wl,-z,relro -Wl,--as-needed -Wl,-z,now -specs=/usr/lib/rpm/redhat/redhat-hardened-ld -specs=/usr/lib/rpm/redhat/redhat-annobin-cc1 -Wl,--build-id=sha1 -specs=/usr/lib/rpm/redhat/redhat-package-notes -o libvmod_tcp.la -rpath /usr/lib64/varnish/vmods vmod_tcp.lo vcc_tcp_if.lo libtool: link: gcc -shared -fPIC -DPIC .libs/vmod_tcp.o .libs/vcc_tcp_if.o -lvarnishapi -Wl,-z,now -specs=/usr/lib/rpm/redhat/redhat-hardened-ld -O2 -flto=auto -g -grecord-gcc-switches -specs=/usr/lib/rpm/redhat/redhat-hardened-cc1 -fstack-protector-strong -specs=/usr/lib/rpm/redhat/redhat-annobin-cc1 -Wl,-z -Wl,relro -Wl,--as-needed -Wl,-z -Wl,now -specs=/usr/lib/rpm/redhat/redhat-hardened-ld -specs=/usr/lib/rpm/redhat/redhat-annobin-cc1 -Wl,--build-id=sha1 -specs=/usr/lib/rpm/redhat/redhat-package-notes -Wl,-soname -Wl,libvmod_tcp.so -o .libs/libvmod_tcp.so libtool: link: ( cd ".libs" && rm -f "libvmod_tcp.la" && ln -s "../libvmod_tcp.la" "libvmod_tcp.la" ) make[2]: Leaving directory '/builddir/build/BUILD/varnish-modules-0.21.0/src' make[2]: Entering directory '/builddir/build/BUILD/varnish-modules-0.21.0/src' /bin/sh ../libtool --tag=CC --mode=link gcc -I/usr/include/varnish -I../src/foreign -Wall -Werror -Wall -Wno-format-y2k -Wstrict-prototypes -Wmissing-prototypes -Werror=missing-field-initializers -Wpointer-arith -Wreturn-type -Wwrite-strings -Wcast-qual -Wswitch -Wshadow -Wunused-parameter -Wcast-align -Wchar-subscripts -Wnested-externs -Wextra -Wno-sign-compare -O2 -flto=auto -ffat-lto-objects -fexceptions -g -grecord-gcc-switches -pipe -Wall -Werror=format-security -Wp,-U_FORTIFY_SOURCE,-D_FORTIFY_SOURCE=3 -Wp,-D_GLIBCXX_ASSERTIONS -specs=/usr/lib/rpm/redhat/redhat-hardened-cc1 -fstack-protector-strong -specs=/usr/lib/rpm/redhat/redhat-annobin-cc1 -fasynchronous-unwind-tables -fstack-clash-protection -fno-omit-frame-pointer -lvarnishapi -module -export-dynamic -avoid-version -shared -Wl,-z,relro -Wl,--as-needed -Wl,-z,now -specs=/usr/lib/rpm/redhat/redhat-hardened-ld -specs=/usr/lib/rpm/redhat/redhat-annobin-cc1 -Wl,--build-id=sha1 -specs=/usr/lib/rpm/redhat/redhat-package-notes -o libvmod_bodyaccess.la -rpath /usr/lib64/varnish/vmods vmod_bodyaccess.lo vcc_bodyaccess_if.lo libtool: link: gcc -shared -fPIC -DPIC .libs/vmod_bodyaccess.o .libs/vcc_bodyaccess_if.o -lvarnishapi -Wl,-z,now -specs=/usr/lib/rpm/redhat/redhat-hardened-ld -O2 -flto=auto -g -grecord-gcc-switches -specs=/usr/lib/rpm/redhat/redhat-hardened-cc1 -fstack-protector-strong -specs=/usr/lib/rpm/redhat/redhat-annobin-cc1 -Wl,-z -Wl,relro -Wl,--as-needed -Wl,-z -Wl,now -specs=/usr/lib/rpm/redhat/redhat-hardened-ld -specs=/usr/lib/rpm/redhat/redhat-annobin-cc1 -Wl,--build-id=sha1 -specs=/usr/lib/rpm/redhat/redhat-package-notes -Wl,-soname -Wl,libvmod_bodyaccess.so -o .libs/libvmod_bodyaccess.so libtool: link: ( cd ".libs" && rm -f "libvmod_bodyaccess.la" && ln -s "../libvmod_bodyaccess.la" "libvmod_bodyaccess.la" ) make[2]: Leaving directory '/builddir/build/BUILD/varnish-modules-0.21.0/src' make[2]: Entering directory '/builddir/build/BUILD/varnish-modules-0.21.0/src' /bin/sh ../libtool --tag=CC --mode=link gcc -I/usr/include/varnish -I../src/foreign -Wall -Werror -Wall -Wno-format-y2k -Wstrict-prototypes -Wmissing-prototypes -Werror=missing-field-initializers -Wpointer-arith -Wreturn-type -Wwrite-strings -Wcast-qual -Wswitch -Wshadow -Wunused-parameter -Wcast-align -Wchar-subscripts -Wnested-externs -Wextra -Wno-sign-compare -O2 -flto=auto -ffat-lto-objects -fexceptions -g -grecord-gcc-switches -pipe -Wall -Werror=format-security -Wp,-U_FORTIFY_SOURCE,-D_FORTIFY_SOURCE=3 -Wp,-D_GLIBCXX_ASSERTIONS -specs=/usr/lib/rpm/redhat/redhat-hardened-cc1 -fstack-protector-strong -specs=/usr/lib/rpm/redhat/redhat-annobin-cc1 -fasynchronous-unwind-tables -fstack-clash-protection -fno-omit-frame-pointer -lvarnishapi -module -export-dynamic -avoid-version -shared -Wl,-z,relro -Wl,--as-needed -Wl,-z,now -specs=/usr/lib/rpm/redhat/redhat-hardened-ld -specs=/usr/lib/rpm/redhat/redhat-annobin-cc1 -Wl,--build-id=sha1 -specs=/usr/lib/rpm/redhat/redhat-package-notes -o libvmod_str.la -rpath /usr/lib64/varnish/vmods vmod_str.lo vcc_str_if.lo libtool: link: gcc -shared -fPIC -DPIC .libs/vmod_str.o .libs/vcc_str_if.o -lvarnishapi -Wl,-z,now -specs=/usr/lib/rpm/redhat/redhat-hardened-ld -O2 -flto=auto -g -grecord-gcc-switches -specs=/usr/lib/rpm/redhat/redhat-hardened-cc1 -fstack-protector-strong -specs=/usr/lib/rpm/redhat/redhat-annobin-cc1 -Wl,-z -Wl,relro -Wl,--as-needed -Wl,-z -Wl,now -specs=/usr/lib/rpm/redhat/redhat-hardened-ld -specs=/usr/lib/rpm/redhat/redhat-annobin-cc1 -Wl,--build-id=sha1 -specs=/usr/lib/rpm/redhat/redhat-package-notes -Wl,-soname -Wl,libvmod_str.so -o .libs/libvmod_str.so libtool: link: ( cd ".libs" && rm -f "libvmod_str.la" && ln -s "../libvmod_str.la" "libvmod_str.la" ) make[2]: Leaving directory '/builddir/build/BUILD/varnish-modules-0.21.0/src' make[2]: Entering directory '/builddir/build/BUILD/varnish-modules-0.21.0/src' /bin/sh ../libtool --tag=CC --mode=link gcc -I/usr/include/varnish -I../src/foreign -Wall -Werror -Wall -Wno-format-y2k -Wstrict-prototypes -Wmissing-prototypes -Werror=missing-field-initializers -Wpointer-arith -Wreturn-type -Wwrite-strings -Wcast-qual -Wswitch -Wshadow -Wunused-parameter -Wcast-align -Wchar-subscripts -Wnested-externs -Wextra -Wno-sign-compare -O2 -flto=auto -ffat-lto-objects -fexceptions -g -grecord-gcc-switches -pipe -Wall -Werror=format-security -Wp,-U_FORTIFY_SOURCE,-D_FORTIFY_SOURCE=3 -Wp,-D_GLIBCXX_ASSERTIONS -specs=/usr/lib/rpm/redhat/redhat-hardened-cc1 -fstack-protector-strong -specs=/usr/lib/rpm/redhat/redhat-annobin-cc1 -fasynchronous-unwind-tables -fstack-clash-protection -fno-omit-frame-pointer -lvarnishapi -module -export-dynamic -avoid-version -shared -Wl,-z,relro -Wl,--as-needed -Wl,-z,now -specs=/usr/lib/rpm/redhat/redhat-hardened-ld -specs=/usr/lib/rpm/redhat/redhat-annobin-cc1 -Wl,--build-id=sha1 -specs=/usr/lib/rpm/redhat/redhat-package-notes -o libvmod_header.la -rpath /usr/lib64/varnish/vmods vmod_header.lo vcc_header_if.lo libtool: link: gcc -shared -fPIC -DPIC .libs/vmod_header.o .libs/vcc_header_if.o -lvarnishapi -Wl,-z,now -specs=/usr/lib/rpm/redhat/redhat-hardened-ld -O2 -flto=auto -g -grecord-gcc-switches -specs=/usr/lib/rpm/redhat/redhat-hardened-cc1 -fstack-protector-strong -specs=/usr/lib/rpm/redhat/redhat-annobin-cc1 -Wl,-z -Wl,relro -Wl,--as-needed -Wl,-z -Wl,now -specs=/usr/lib/rpm/redhat/redhat-hardened-ld -specs=/usr/lib/rpm/redhat/redhat-annobin-cc1 -Wl,--build-id=sha1 -specs=/usr/lib/rpm/redhat/redhat-package-notes -Wl,-soname -Wl,libvmod_header.so -o .libs/libvmod_header.so libtool: link: ( cd ".libs" && rm -f "libvmod_header.la" && ln -s "../libvmod_header.la" "libvmod_header.la" ) make[2]: Leaving directory '/builddir/build/BUILD/varnish-modules-0.21.0/src' make[2]: Entering directory '/builddir/build/BUILD/varnish-modules-0.21.0/src' /bin/sh ../libtool --tag=CC --mode=link gcc -I/usr/include/varnish -I../src/foreign -Wall -Werror -Wall -Wno-format-y2k -Wstrict-prototypes -Wmissing-prototypes -Werror=missing-field-initializers -Wpointer-arith -Wreturn-type -Wwrite-strings -Wcast-qual -Wswitch -Wshadow -Wunused-parameter -Wcast-align -Wchar-subscripts -Wnested-externs -Wextra -Wno-sign-compare -O2 -flto=auto -ffat-lto-objects -fexceptions -g -grecord-gcc-switches -pipe -Wall -Werror=format-security -Wp,-U_FORTIFY_SOURCE,-D_FORTIFY_SOURCE=3 -Wp,-D_GLIBCXX_ASSERTIONS -specs=/usr/lib/rpm/redhat/redhat-hardened-cc1 -fstack-protector-strong -specs=/usr/lib/rpm/redhat/redhat-annobin-cc1 -fasynchronous-unwind-tables -fstack-clash-protection -fno-omit-frame-pointer -lvarnishapi -module -export-dynamic -avoid-version -shared -Wl,-z,relro -Wl,--as-needed -Wl,-z,now -specs=/usr/lib/rpm/redhat/redhat-hardened-ld -specs=/usr/lib/rpm/redhat/redhat-annobin-cc1 -Wl,--build-id=sha1 -specs=/usr/lib/rpm/redhat/redhat-package-notes -o libvmod_accept.la -rpath /usr/lib64/varnish/vmods vmod_accept.lo vcc_accept_if.lo libtool: link: gcc -shared -fPIC -DPIC .libs/vmod_accept.o .libs/vcc_accept_if.o -lvarnishapi -Wl,-z,now -specs=/usr/lib/rpm/redhat/redhat-hardened-ld -O2 -flto=auto -g -grecord-gcc-switches -specs=/usr/lib/rpm/redhat/redhat-hardened-cc1 -fstack-protector-strong -specs=/usr/lib/rpm/redhat/redhat-annobin-cc1 -Wl,-z -Wl,relro -Wl,--as-needed -Wl,-z -Wl,now -specs=/usr/lib/rpm/redhat/redhat-hardened-ld -specs=/usr/lib/rpm/redhat/redhat-annobin-cc1 -Wl,--build-id=sha1 -specs=/usr/lib/rpm/redhat/redhat-package-notes -Wl,-soname -Wl,libvmod_accept.so -o .libs/libvmod_accept.so libtool: link: ( cd ".libs" && rm -f "libvmod_accept.la" && ln -s "../libvmod_accept.la" "libvmod_accept.la" ) make[2]: Leaving directory '/builddir/build/BUILD/varnish-modules-0.21.0/src' make[2]: Entering directory '/builddir/build/BUILD/varnish-modules-0.21.0/src' /bin/sh ../libtool --tag=CC --mode=link gcc -I/usr/include/varnish -I../src/foreign -Wall -Werror -Wall -Wno-format-y2k -Wstrict-prototypes -Wmissing-prototypes -Werror=missing-field-initializers -Wpointer-arith -Wreturn-type -Wwrite-strings -Wcast-qual -Wswitch -Wshadow -Wunused-parameter -Wcast-align -Wchar-subscripts -Wnested-externs -Wextra -Wno-sign-compare -O2 -flto=auto -ffat-lto-objects -fexceptions -g -grecord-gcc-switches -pipe -Wall -Werror=format-security -Wp,-U_FORTIFY_SOURCE,-D_FORTIFY_SOURCE=3 -Wp,-D_GLIBCXX_ASSERTIONS -specs=/usr/lib/rpm/redhat/redhat-hardened-cc1 -fstack-protector-strong -specs=/usr/lib/rpm/redhat/redhat-annobin-cc1 -fasynchronous-unwind-tables -fstack-clash-protection -fno-omit-frame-pointer -lvarnishapi -module -export-dynamic -avoid-version -shared -Wl,-z,relro -Wl,--as-needed -Wl,-z,now -specs=/usr/lib/rpm/redhat/redhat-hardened-ld -specs=/usr/lib/rpm/redhat/redhat-annobin-cc1 -Wl,--build-id=sha1 -specs=/usr/lib/rpm/redhat/redhat-package-notes -o libvmod_saintmode.la -rpath /usr/lib64/varnish/vmods vmod_saintmode.lo vcc_saintmode_if.lo libtool: link: gcc -shared -fPIC -DPIC .libs/vmod_saintmode.o .libs/vcc_saintmode_if.o -lvarnishapi -Wl,-z,now -specs=/usr/lib/rpm/redhat/redhat-hardened-ld -O2 -flto=auto -g -grecord-gcc-switches -specs=/usr/lib/rpm/redhat/redhat-hardened-cc1 -fstack-protector-strong -specs=/usr/lib/rpm/redhat/redhat-annobin-cc1 -Wl,-z -Wl,relro -Wl,--as-needed -Wl,-z -Wl,now -specs=/usr/lib/rpm/redhat/redhat-hardened-ld -specs=/usr/lib/rpm/redhat/redhat-annobin-cc1 -Wl,--build-id=sha1 -specs=/usr/lib/rpm/redhat/redhat-package-notes -Wl,-soname -Wl,libvmod_saintmode.so -o .libs/libvmod_saintmode.so libtool: link: ( cd ".libs" && rm -f "libvmod_saintmode.la" && ln -s "../libvmod_saintmode.la" "libvmod_saintmode.la" ) make[2]: Leaving directory '/builddir/build/BUILD/varnish-modules-0.21.0/src' make[2]: Entering directory '/builddir/build/BUILD/varnish-modules-0.21.0/src' /bin/sh ../libtool --tag=CC --mode=compile gcc -DHAVE_CONFIG_H -I. -I.. -I/usr/include/varnish -I../src/foreign -Wall -Werror -Wall -Wno-format-y2k -Wstrict-prototypes -Wmissing-prototypes -Werror=missing-field-initializers -Wpointer-arith -Wreturn-type -Wwrite-strings -Wcast-qual -Wswitch -Wshadow -Wunused-parameter -Wcast-align -Wchar-subscripts -Wnested-externs -Wextra -Wno-sign-compare -O2 -flto=auto -ffat-lto-objects -fexceptions -g -grecord-gcc-switches -pipe -Wall -Werror=format-security -Wp,-U_FORTIFY_SOURCE,-D_FORTIFY_SOURCE=3 -Wp,-D_GLIBCXX_ASSERTIONS -specs=/usr/lib/rpm/redhat/redhat-hardened-cc1 -fstack-protector-strong -specs=/usr/lib/rpm/redhat/redhat-annobin-cc1 -fasynchronous-unwind-tables -fstack-clash-protection -fno-omit-frame-pointer -c -o vmod_xkey.lo vmod_xkey.c libtool: compile: gcc -DHAVE_CONFIG_H -I. -I.. -I/usr/include/varnish -I../src/foreign -Wall -Werror -Wall -Wno-format-y2k -Wstrict-prototypes -Wmissing-prototypes -Werror=missing-field-initializers -Wpointer-arith -Wreturn-type -Wwrite-strings -Wcast-qual -Wswitch -Wshadow -Wunused-parameter -Wcast-align -Wchar-subscripts -Wnested-externs -Wextra -Wno-sign-compare -O2 -flto=auto -ffat-lto-objects -fexceptions -g -grecord-gcc-switches -pipe -Wall -Werror=format-security -Wp,-U_FORTIFY_SOURCE,-D_FORTIFY_SOURCE=3 -Wp,-D_GLIBCXX_ASSERTIONS -specs=/usr/lib/rpm/redhat/redhat-hardened-cc1 -fstack-protector-strong -specs=/usr/lib/rpm/redhat/redhat-annobin-cc1 -fasynchronous-unwind-tables -fstack-clash-protection -fno-omit-frame-pointer -c vmod_xkey.c -fPIC -DPIC -o .libs/vmod_xkey.o make[2]: Leaving directory '/builddir/build/BUILD/varnish-modules-0.21.0/src' make[2]: Entering directory '/builddir/build/BUILD/varnish-modules-0.21.0/src' /bin/sh ../libtool --tag=CC --mode=link gcc -I/usr/include/varnish -I../src/foreign -Wall -Werror -Wall -Wno-format-y2k -Wstrict-prototypes -Wmissing-prototypes -Werror=missing-field-initializers -Wpointer-arith -Wreturn-type -Wwrite-strings -Wcast-qual -Wswitch -Wshadow -Wunused-parameter -Wcast-align -Wchar-subscripts -Wnested-externs -Wextra -Wno-sign-compare -O2 -flto=auto -ffat-lto-objects -fexceptions -g -grecord-gcc-switches -pipe -Wall -Werror=format-security -Wp,-U_FORTIFY_SOURCE,-D_FORTIFY_SOURCE=3 -Wp,-D_GLIBCXX_ASSERTIONS -specs=/usr/lib/rpm/redhat/redhat-hardened-cc1 -fstack-protector-strong -specs=/usr/lib/rpm/redhat/redhat-annobin-cc1 -fasynchronous-unwind-tables -fstack-clash-protection -fno-omit-frame-pointer -lvarnishapi -module -export-dynamic -avoid-version -shared -Wl,-z,relro -Wl,--as-needed -Wl,-z,now -specs=/usr/lib/rpm/redhat/redhat-hardened-ld -specs=/usr/lib/rpm/redhat/redhat-annobin-cc1 -Wl,--build-id=sha1 -specs=/usr/lib/rpm/redhat/redhat-package-notes -o libvmod_var.la -rpath /usr/lib64/varnish/vmods vmod_var.lo vcc_var_if.lo libtool: link: gcc -shared -fPIC -DPIC .libs/vmod_var.o .libs/vcc_var_if.o -lvarnishapi -Wl,-z,now -specs=/usr/lib/rpm/redhat/redhat-hardened-ld -O2 -flto=auto -g -grecord-gcc-switches -specs=/usr/lib/rpm/redhat/redhat-hardened-cc1 -fstack-protector-strong -specs=/usr/lib/rpm/redhat/redhat-annobin-cc1 -Wl,-z -Wl,relro -Wl,--as-needed -Wl,-z -Wl,now -specs=/usr/lib/rpm/redhat/redhat-hardened-ld -specs=/usr/lib/rpm/redhat/redhat-annobin-cc1 -Wl,--build-id=sha1 -specs=/usr/lib/rpm/redhat/redhat-package-notes -Wl,-soname -Wl,libvmod_var.so -o .libs/libvmod_var.so libtool: link: ( cd ".libs" && rm -f "libvmod_var.la" && ln -s "../libvmod_var.la" "libvmod_var.la" ) make[2]: Leaving directory '/builddir/build/BUILD/varnish-modules-0.21.0/src' make[2]: Entering directory '/builddir/build/BUILD/varnish-modules-0.21.0/src' /bin/sh ../libtool --tag=CC --mode=link gcc -I/usr/include/varnish -I../src/foreign -Wall -Werror -Wall -Wno-format-y2k -Wstrict-prototypes -Wmissing-prototypes -Werror=missing-field-initializers -Wpointer-arith -Wreturn-type -Wwrite-strings -Wcast-qual -Wswitch -Wshadow -Wunused-parameter -Wcast-align -Wchar-subscripts -Wnested-externs -Wextra -Wno-sign-compare -O2 -flto=auto -ffat-lto-objects -fexceptions -g -grecord-gcc-switches -pipe -Wall -Werror=format-security -Wp,-U_FORTIFY_SOURCE,-D_FORTIFY_SOURCE=3 -Wp,-D_GLIBCXX_ASSERTIONS -specs=/usr/lib/rpm/redhat/redhat-hardened-cc1 -fstack-protector-strong -specs=/usr/lib/rpm/redhat/redhat-annobin-cc1 -fasynchronous-unwind-tables -fstack-clash-protection -fno-omit-frame-pointer -lvarnishapi -module -export-dynamic -avoid-version -shared -Wl,-z,relro -Wl,--as-needed -Wl,-z,now -specs=/usr/lib/rpm/redhat/redhat-hardened-ld -specs=/usr/lib/rpm/redhat/redhat-annobin-cc1 -Wl,--build-id=sha1 -specs=/usr/lib/rpm/redhat/redhat-package-notes -o libvmod_vsthrottle.la -rpath /usr/lib64/varnish/vmods vmod_vsthrottle.lo vcc_vsthrottle_if.lo libtool: link: gcc -shared -fPIC -DPIC .libs/vmod_vsthrottle.o .libs/vcc_vsthrottle_if.o -lvarnishapi -Wl,-z,now -specs=/usr/lib/rpm/redhat/redhat-hardened-ld -O2 -flto=auto -g -grecord-gcc-switches -specs=/usr/lib/rpm/redhat/redhat-hardened-cc1 -fstack-protector-strong -specs=/usr/lib/rpm/redhat/redhat-annobin-cc1 -Wl,-z -Wl,relro -Wl,--as-needed -Wl,-z -Wl,now -specs=/usr/lib/rpm/redhat/redhat-hardened-ld -specs=/usr/lib/rpm/redhat/redhat-annobin-cc1 -Wl,--build-id=sha1 -specs=/usr/lib/rpm/redhat/redhat-package-notes -Wl,-soname -Wl,libvmod_vsthrottle.so -o .libs/libvmod_vsthrottle.so libtool: link: ( cd ".libs" && rm -f "libvmod_vsthrottle.la" && ln -s "../libvmod_vsthrottle.la" "libvmod_vsthrottle.la" ) make[2]: Leaving directory '/builddir/build/BUILD/varnish-modules-0.21.0/src' make[2]: Entering directory '/builddir/build/BUILD/varnish-modules-0.21.0/src' /bin/sh ../libtool --tag=CC --mode=link gcc -I/usr/include/varnish -I../src/foreign -Wall -Werror -Wall -Wno-format-y2k -Wstrict-prototypes -Wmissing-prototypes -Werror=missing-field-initializers -Wpointer-arith -Wreturn-type -Wwrite-strings -Wcast-qual -Wswitch -Wshadow -Wunused-parameter -Wcast-align -Wchar-subscripts -Wnested-externs -Wextra -Wno-sign-compare -O2 -flto=auto -ffat-lto-objects -fexceptions -g -grecord-gcc-switches -pipe -Wall -Werror=format-security -Wp,-U_FORTIFY_SOURCE,-D_FORTIFY_SOURCE=3 -Wp,-D_GLIBCXX_ASSERTIONS -specs=/usr/lib/rpm/redhat/redhat-hardened-cc1 -fstack-protector-strong -specs=/usr/lib/rpm/redhat/redhat-annobin-cc1 -fasynchronous-unwind-tables -fstack-clash-protection -fno-omit-frame-pointer -lvarnishapi -module -export-dynamic -avoid-version -shared -Wl,-z,relro -Wl,--as-needed -Wl,-z,now -specs=/usr/lib/rpm/redhat/redhat-hardened-ld -specs=/usr/lib/rpm/redhat/redhat-annobin-cc1 -Wl,--build-id=sha1 -specs=/usr/lib/rpm/redhat/redhat-package-notes -o libvmod_xkey.la -rpath /usr/lib64/varnish/vmods vmod_xkey.lo vcc_xkey_if.lo VSC_xkey.lo libtool: link: gcc -shared -fPIC -DPIC .libs/vmod_xkey.o .libs/vcc_xkey_if.o .libs/VSC_xkey.o -lvarnishapi -Wl,-z,now -specs=/usr/lib/rpm/redhat/redhat-hardened-ld -O2 -flto=auto -g -grecord-gcc-switches -specs=/usr/lib/rpm/redhat/redhat-hardened-cc1 -fstack-protector-strong -specs=/usr/lib/rpm/redhat/redhat-annobin-cc1 -Wl,-z -Wl,relro -Wl,--as-needed -Wl,-z -Wl,now -specs=/usr/lib/rpm/redhat/redhat-hardened-ld -specs=/usr/lib/rpm/redhat/redhat-annobin-cc1 -Wl,--build-id=sha1 -specs=/usr/lib/rpm/redhat/redhat-package-notes -Wl,-soname -Wl,libvmod_xkey.so -o .libs/libvmod_xkey.so libtool: link: ( cd ".libs" && rm -f "libvmod_xkey.la" && ln -s "../libvmod_xkey.la" "libvmod_xkey.la" ) make[2]: Leaving directory '/builddir/build/BUILD/varnish-modules-0.21.0/src' + RPM_EC=0 ++ jobs -p + exit 0 Executing(%install): /bin/sh -e /var/tmp/rpm-tmp.OyBfmE + umask 022 + cd /builddir/build/BUILD + '[' /builddir/build/BUILDROOT/varnish-modules-0.21.0-3.fc38.riscv64 '!=' / ']' + rm -rf /builddir/build/BUILDROOT/varnish-modules-0.21.0-3.fc38.riscv64 ++ dirname /builddir/build/BUILDROOT/varnish-modules-0.21.0-3.fc38.riscv64 + mkdir -p /builddir/build/BUILDROOT + mkdir /builddir/build/BUILDROOT/varnish-modules-0.21.0-3.fc38.riscv64 + CFLAGS='-O2 -flto=auto -ffat-lto-objects -fexceptions -g -grecord-gcc-switches -pipe -Wall -Werror=format-security -Wp,-U_FORTIFY_SOURCE,-D_FORTIFY_SOURCE=3 -Wp,-D_GLIBCXX_ASSERTIONS -specs=/usr/lib/rpm/redhat/redhat-hardened-cc1 -fstack-protector-strong -specs=/usr/lib/rpm/redhat/redhat-annobin-cc1 -fasynchronous-unwind-tables -fstack-clash-protection -fno-omit-frame-pointer ' + export CFLAGS + CXXFLAGS='-O2 -flto=auto -ffat-lto-objects -fexceptions -g -grecord-gcc-switches -pipe -Wall -Werror=format-security -Wp,-U_FORTIFY_SOURCE,-D_FORTIFY_SOURCE=3 -Wp,-D_GLIBCXX_ASSERTIONS -specs=/usr/lib/rpm/redhat/redhat-hardened-cc1 -fstack-protector-strong -specs=/usr/lib/rpm/redhat/redhat-annobin-cc1 -fasynchronous-unwind-tables -fstack-clash-protection -fno-omit-frame-pointer ' + export CXXFLAGS + FFLAGS='-O2 -flto=auto -ffat-lto-objects -fexceptions -g -grecord-gcc-switches -pipe -Wall -Werror=format-security -Wp,-U_FORTIFY_SOURCE,-D_FORTIFY_SOURCE=3 -Wp,-D_GLIBCXX_ASSERTIONS -specs=/usr/lib/rpm/redhat/redhat-hardened-cc1 -fstack-protector-strong -specs=/usr/lib/rpm/redhat/redhat-annobin-cc1 -fasynchronous-unwind-tables -fstack-clash-protection -fno-omit-frame-pointer -I/usr/lib64/gfortran/modules ' + export FFLAGS + FCFLAGS='-O2 -flto=auto -ffat-lto-objects -fexceptions -g -grecord-gcc-switches -pipe -Wall -Werror=format-security -Wp,-U_FORTIFY_SOURCE,-D_FORTIFY_SOURCE=3 -Wp,-D_GLIBCXX_ASSERTIONS -specs=/usr/lib/rpm/redhat/redhat-hardened-cc1 -fstack-protector-strong -specs=/usr/lib/rpm/redhat/redhat-annobin-cc1 -fasynchronous-unwind-tables -fstack-clash-protection -fno-omit-frame-pointer -I/usr/lib64/gfortran/modules ' + export FCFLAGS + VALAFLAGS=-g + export VALAFLAGS + LDFLAGS='-Wl,-z,relro -Wl,--as-needed -Wl,-z,now -specs=/usr/lib/rpm/redhat/redhat-hardened-ld -specs=/usr/lib/rpm/redhat/redhat-annobin-cc1 -Wl,--build-id=sha1 -specs=/usr/lib/rpm/redhat/redhat-package-notes ' + export LDFLAGS + LT_SYS_LIBRARY_PATH=/usr/lib64: + export LT_SYS_LIBRARY_PATH + CC=gcc + export CC + CXX=g++ + export CXX + cd varnish-modules-0.21.0 + /usr/bin/make install DESTDIR=/builddir/build/BUILDROOT/varnish-modules-0.21.0-3.fc38.riscv64 'INSTALL=/usr/bin/install -p' docdir=/usr/share/doc/varnish-modules Making install in src make[1]: Entering directory '/builddir/build/BUILD/varnish-modules-0.21.0/src' make[2]: Entering directory '/builddir/build/BUILD/varnish-modules-0.21.0/src' make[2]: Nothing to be done for 'install-exec-am'. /usr/bin/mkdir -p '/builddir/build/BUILDROOT/varnish-modules-0.21.0-3.fc38.riscv64/usr/share/man/man3' /usr/bin/install -p -m 644 vmod_accept.3 vmod_bodyaccess.3 vmod_header.3 vmod_saintmode.3 vmod_str.3 vmod_tcp.3 vmod_var.3 vmod_vsthrottle.3 vmod_xkey.3 '/builddir/build/BUILDROOT/varnish-modules-0.21.0-3.fc38.riscv64/usr/share/man/man3' /usr/bin/mkdir -p '/builddir/build/BUILDROOT/varnish-modules-0.21.0-3.fc38.riscv64/usr/lib64/varnish/vmods' /bin/sh ../libtool --mode=install /usr/bin/install -p libvmod_accept.la libvmod_bodyaccess.la libvmod_header.la libvmod_saintmode.la libvmod_str.la libvmod_tcp.la libvmod_var.la libvmod_vsthrottle.la libvmod_xkey.la '/builddir/build/BUILDROOT/varnish-modules-0.21.0-3.fc38.riscv64/usr/lib64/varnish/vmods' libtool: install: /usr/bin/install -p .libs/libvmod_accept.so /builddir/build/BUILDROOT/varnish-modules-0.21.0-3.fc38.riscv64/usr/lib64/varnish/vmods/libvmod_accept.so libtool: install: /usr/bin/install -p .libs/libvmod_accept.lai /builddir/build/BUILDROOT/varnish-modules-0.21.0-3.fc38.riscv64/usr/lib64/varnish/vmods/libvmod_accept.la libtool: install: /usr/bin/install -p .libs/libvmod_bodyaccess.so /builddir/build/BUILDROOT/varnish-modules-0.21.0-3.fc38.riscv64/usr/lib64/varnish/vmods/libvmod_bodyaccess.so libtool: install: /usr/bin/install -p .libs/libvmod_bodyaccess.lai /builddir/build/BUILDROOT/varnish-modules-0.21.0-3.fc38.riscv64/usr/lib64/varnish/vmods/libvmod_bodyaccess.la libtool: install: /usr/bin/install -p .libs/libvmod_header.so /builddir/build/BUILDROOT/varnish-modules-0.21.0-3.fc38.riscv64/usr/lib64/varnish/vmods/libvmod_header.so libtool: install: /usr/bin/install -p .libs/libvmod_header.lai /builddir/build/BUILDROOT/varnish-modules-0.21.0-3.fc38.riscv64/usr/lib64/varnish/vmods/libvmod_header.la libtool: install: /usr/bin/install -p .libs/libvmod_saintmode.so /builddir/build/BUILDROOT/varnish-modules-0.21.0-3.fc38.riscv64/usr/lib64/varnish/vmods/libvmod_saintmode.so libtool: install: /usr/bin/install -p .libs/libvmod_saintmode.lai /builddir/build/BUILDROOT/varnish-modules-0.21.0-3.fc38.riscv64/usr/lib64/varnish/vmods/libvmod_saintmode.la libtool: install: /usr/bin/install -p .libs/libvmod_str.so /builddir/build/BUILDROOT/varnish-modules-0.21.0-3.fc38.riscv64/usr/lib64/varnish/vmods/libvmod_str.so libtool: install: /usr/bin/install -p .libs/libvmod_str.lai /builddir/build/BUILDROOT/varnish-modules-0.21.0-3.fc38.riscv64/usr/lib64/varnish/vmods/libvmod_str.la libtool: install: /usr/bin/install -p .libs/libvmod_tcp.so /builddir/build/BUILDROOT/varnish-modules-0.21.0-3.fc38.riscv64/usr/lib64/varnish/vmods/libvmod_tcp.so libtool: install: /usr/bin/install -p .libs/libvmod_tcp.lai /builddir/build/BUILDROOT/varnish-modules-0.21.0-3.fc38.riscv64/usr/lib64/varnish/vmods/libvmod_tcp.la libtool: install: /usr/bin/install -p .libs/libvmod_var.so /builddir/build/BUILDROOT/varnish-modules-0.21.0-3.fc38.riscv64/usr/lib64/varnish/vmods/libvmod_var.so libtool: install: /usr/bin/install -p .libs/libvmod_var.lai /builddir/build/BUILDROOT/varnish-modules-0.21.0-3.fc38.riscv64/usr/lib64/varnish/vmods/libvmod_var.la libtool: install: /usr/bin/install -p .libs/libvmod_vsthrottle.so /builddir/build/BUILDROOT/varnish-modules-0.21.0-3.fc38.riscv64/usr/lib64/varnish/vmods/libvmod_vsthrottle.so libtool: install: /usr/bin/install -p .libs/libvmod_vsthrottle.lai /builddir/build/BUILDROOT/varnish-modules-0.21.0-3.fc38.riscv64/usr/lib64/varnish/vmods/libvmod_vsthrottle.la libtool: install: /usr/bin/install -p .libs/libvmod_xkey.so /builddir/build/BUILDROOT/varnish-modules-0.21.0-3.fc38.riscv64/usr/lib64/varnish/vmods/libvmod_xkey.so libtool: install: /usr/bin/install -p .libs/libvmod_xkey.lai /builddir/build/BUILDROOT/varnish-modules-0.21.0-3.fc38.riscv64/usr/lib64/varnish/vmods/libvmod_xkey.la libtool: warning: remember to run 'libtool --finish /usr/lib64/varnish/vmods' make[2]: Leaving directory '/builddir/build/BUILD/varnish-modules-0.21.0/src' make[1]: Leaving directory '/builddir/build/BUILD/varnish-modules-0.21.0/src' make[1]: Entering directory '/builddir/build/BUILD/varnish-modules-0.21.0' make[2]: Entering directory '/builddir/build/BUILD/varnish-modules-0.21.0' make[2]: Nothing to be done for 'install-exec-am'. /usr/bin/mkdir -p '/builddir/build/BUILDROOT/varnish-modules-0.21.0-3.fc38.riscv64/usr/share/doc/varnish-modules' /usr/bin/install -p -m 644 README.md LICENSE '/builddir/build/BUILDROOT/varnish-modules-0.21.0-3.fc38.riscv64/usr/share/doc/varnish-modules' make[2]: Leaving directory '/builddir/build/BUILD/varnish-modules-0.21.0' make[1]: Leaving directory '/builddir/build/BUILD/varnish-modules-0.21.0' + find /builddir/build/BUILDROOT/varnish-modules-0.21.0-3.fc38.riscv64//usr/lib64/ -name '*.la' -exec rm -f '{}' ';' + rm /builddir/build/BUILDROOT/varnish-modules-0.21.0-3.fc38.riscv64/usr/share/doc/varnish-modules/LICENSE + /usr/bin/find-debuginfo -j8 --strict-build-id -m -i --build-id-seed 0.21.0-3.fc38 --unique-debug-suffix -0.21.0-3.fc38.riscv64 --unique-debug-src-base varnish-modules-0.21.0-3.fc38.riscv64 --run-dwz --dwz-low-mem-die-limit 10000000 --dwz-max-die-limit 50000000 -S debugsourcefiles.list /builddir/build/BUILD/varnish-modules-0.21.0 extracting debug info from /builddir/build/BUILDROOT/varnish-modules-0.21.0-3.fc38.riscv64/usr/lib64/varnish/vmods/libvmod_bodyaccess.so extracting debug info from /builddir/build/BUILDROOT/varnish-modules-0.21.0-3.fc38.riscv64/usr/lib64/varnish/vmods/libvmod_accept.so extracting debug info from /builddir/build/BUILDROOT/varnish-modules-0.21.0-3.fc38.riscv64/usr/lib64/varnish/vmods/libvmod_header.so extracting debug info from /builddir/build/BUILDROOT/varnish-modules-0.21.0-3.fc38.riscv64/usr/lib64/varnish/vmods/libvmod_str.so extracting debug info from /builddir/build/BUILDROOT/varnish-modules-0.21.0-3.fc38.riscv64/usr/lib64/varnish/vmods/libvmod_tcp.so extracting debug info from /builddir/build/BUILDROOT/varnish-modules-0.21.0-3.fc38.riscv64/usr/lib64/varnish/vmods/libvmod_vsthrottle.so extracting debug info from /builddir/build/BUILDROOT/varnish-modules-0.21.0-3.fc38.riscv64/usr/lib64/varnish/vmods/libvmod_var.so extracting debug info from /builddir/build/BUILDROOT/varnish-modules-0.21.0-3.fc38.riscv64/usr/lib64/varnish/vmods/libvmod_saintmode.so extracting debug info from /builddir/build/BUILDROOT/varnish-modules-0.21.0-3.fc38.riscv64/usr/lib64/varnish/vmods/libvmod_xkey.so original debug info size: 1084kB, size after compression: 996kB /usr/bin/sepdebugcrcfix: Updated 9 CRC32s, 0 CRC32s did match. 282 blocks + /usr/lib/rpm/check-buildroot + /usr/lib/rpm/redhat/brp-ldconfig + /usr/lib/rpm/brp-compress + /usr/lib/rpm/redhat/brp-strip-lto /usr/bin/strip + /usr/lib/rpm/brp-strip-static-archive /usr/bin/strip + /usr/lib/rpm/check-rpaths + /usr/lib/rpm/redhat/brp-mangle-shebangs + /usr/lib/rpm/brp-remove-la-files + env /usr/lib/rpm/redhat/brp-python-bytecompile '' 1 0 -j8 + /usr/lib/rpm/redhat/brp-python-hardlink Executing(%check): /bin/sh -e /var/tmp/rpm-tmp.TbH68Z + umask 022 + cd /builddir/build/BUILD + CFLAGS='-O2 -flto=auto -ffat-lto-objects -fexceptions -g -grecord-gcc-switches -pipe -Wall -Werror=format-security -Wp,-U_FORTIFY_SOURCE,-D_FORTIFY_SOURCE=3 -Wp,-D_GLIBCXX_ASSERTIONS -specs=/usr/lib/rpm/redhat/redhat-hardened-cc1 -fstack-protector-strong -specs=/usr/lib/rpm/redhat/redhat-annobin-cc1 -fasynchronous-unwind-tables -fstack-clash-protection -fno-omit-frame-pointer ' + export CFLAGS + CXXFLAGS='-O2 -flto=auto -ffat-lto-objects -fexceptions -g -grecord-gcc-switches -pipe -Wall -Werror=format-security -Wp,-U_FORTIFY_SOURCE,-D_FORTIFY_SOURCE=3 -Wp,-D_GLIBCXX_ASSERTIONS -specs=/usr/lib/rpm/redhat/redhat-hardened-cc1 -fstack-protector-strong -specs=/usr/lib/rpm/redhat/redhat-annobin-cc1 -fasynchronous-unwind-tables -fstack-clash-protection -fno-omit-frame-pointer ' + export CXXFLAGS + FFLAGS='-O2 -flto=auto -ffat-lto-objects -fexceptions -g -grecord-gcc-switches -pipe -Wall -Werror=format-security -Wp,-U_FORTIFY_SOURCE,-D_FORTIFY_SOURCE=3 -Wp,-D_GLIBCXX_ASSERTIONS -specs=/usr/lib/rpm/redhat/redhat-hardened-cc1 -fstack-protector-strong -specs=/usr/lib/rpm/redhat/redhat-annobin-cc1 -fasynchronous-unwind-tables -fstack-clash-protection -fno-omit-frame-pointer -I/usr/lib64/gfortran/modules ' + export FFLAGS + FCFLAGS='-O2 -flto=auto -ffat-lto-objects -fexceptions -g -grecord-gcc-switches -pipe -Wall -Werror=format-security -Wp,-U_FORTIFY_SOURCE,-D_FORTIFY_SOURCE=3 -Wp,-D_GLIBCXX_ASSERTIONS -specs=/usr/lib/rpm/redhat/redhat-hardened-cc1 -fstack-protector-strong -specs=/usr/lib/rpm/redhat/redhat-annobin-cc1 -fasynchronous-unwind-tables -fstack-clash-protection -fno-omit-frame-pointer -I/usr/lib64/gfortran/modules ' + export FCFLAGS + VALAFLAGS=-g + export VALAFLAGS + LDFLAGS='-Wl,-z,relro -Wl,--as-needed -Wl,-z,now -specs=/usr/lib/rpm/redhat/redhat-hardened-ld -specs=/usr/lib/rpm/redhat/redhat-annobin-cc1 -Wl,--build-id=sha1 -specs=/usr/lib/rpm/redhat/redhat-package-notes ' + export LDFLAGS + LT_SYS_LIBRARY_PATH=/usr/lib64: + export LT_SYS_LIBRARY_PATH + CC=gcc + export CC + CXX=g++ + export CXX + cd varnish-modules-0.21.0 + /usr/bin/make -O -j8 V=1 VERBOSE=1 check VERBOSE=1 Making check in src /usr/bin/make check-TESTS make[3]: Entering directory '/builddir/build/BUILD/varnish-modules-0.21.0/src' PASS: tests/accept/test02.vtc make[3]: Leaving directory '/builddir/build/BUILD/varnish-modules-0.21.0/src' make[3]: Entering directory '/builddir/build/BUILD/varnish-modules-0.21.0/src' PASS: tests/bodyaccess/test05.vtc make[3]: Leaving directory '/builddir/build/BUILD/varnish-modules-0.21.0/src' make[3]: Entering directory '/builddir/build/BUILD/varnish-modules-0.21.0/src' PASS: tests/accept/test01.vtc make[3]: Leaving directory '/builddir/build/BUILD/varnish-modules-0.21.0/src' make[3]: Entering directory '/builddir/build/BUILD/varnish-modules-0.21.0/src' PASS: tests/header/append.vtc make[3]: Leaving directory '/builddir/build/BUILD/varnish-modules-0.21.0/src' make[3]: Entering directory '/builddir/build/BUILD/varnish-modules-0.21.0/src' PASS: tests/bodyaccess/test04.vtc make[3]: Leaving directory '/builddir/build/BUILD/varnish-modules-0.21.0/src' make[3]: Entering directory '/builddir/build/BUILD/varnish-modules-0.21.0/src' PASS: tests/bodyaccess/test02.vtc make[3]: Leaving directory '/builddir/build/BUILD/varnish-modules-0.21.0/src' make[3]: Entering directory '/builddir/build/BUILD/varnish-modules-0.21.0/src' PASS: tests/bodyaccess/test01.vtc make[3]: Leaving directory '/builddir/build/BUILD/varnish-modules-0.21.0/src' make[3]: Entering directory '/builddir/build/BUILD/varnish-modules-0.21.0/src' PASS: tests/bodyaccess/test03.vtc make[3]: Leaving directory '/builddir/build/BUILD/varnish-modules-0.21.0/src' make[3]: Entering directory '/builddir/build/BUILD/varnish-modules-0.21.0/src' PASS: tests/header/append_maxhdr_overflow.vtc make[3]: Leaving directory '/builddir/build/BUILD/varnish-modules-0.21.0/src' make[3]: Entering directory '/builddir/build/BUILD/varnish-modules-0.21.0/src' PASS: tests/header/import.vtc make[3]: Leaving directory '/builddir/build/BUILD/varnish-modules-0.21.0/src' make[3]: Entering directory '/builddir/build/BUILD/varnish-modules-0.21.0/src' PASS: tests/header/some-data.vtc make[3]: Leaving directory '/builddir/build/BUILD/varnish-modules-0.21.0/src' make[3]: Entering directory '/builddir/build/BUILD/varnish-modules-0.21.0/src' PASS: tests/header/append_overflow.vtc make[3]: Leaving directory '/builddir/build/BUILD/varnish-modules-0.21.0/src' make[3]: Entering directory '/builddir/build/BUILD/varnish-modules-0.21.0/src' PASS: tests/header/keep-others.vtc make[3]: Leaving directory '/builddir/build/BUILD/varnish-modules-0.21.0/src' make[3]: Entering directory '/builddir/build/BUILD/varnish-modules-0.21.0/src' PASS: tests/header/get.vtc make[3]: Leaving directory '/builddir/build/BUILD/varnish-modules-0.21.0/src' make[3]: Entering directory '/builddir/build/BUILD/varnish-modules-0.21.0/src' PASS: tests/header/copy.vtc make[3]: Leaving directory '/builddir/build/BUILD/varnish-modules-0.21.0/src' make[3]: Entering directory '/builddir/build/BUILD/varnish-modules-0.21.0/src' PASS: tests/header/remove.vtc make[3]: Leaving directory '/builddir/build/BUILD/varnish-modules-0.21.0/src' make[3]: Entering directory '/builddir/build/BUILD/varnish-modules-0.21.0/src' PASS: tests/saintmode/test03.vtc make[3]: Leaving directory '/builddir/build/BUILD/varnish-modules-0.21.0/src' make[3]: Entering directory '/builddir/build/BUILD/varnish-modules-0.21.0/src' PASS: tests/saintmode/test05.vtc make[3]: Leaving directory '/builddir/build/BUILD/varnish-modules-0.21.0/src' make[3]: Entering directory '/builddir/build/BUILD/varnish-modules-0.21.0/src' PASS: tests/header/regsub.vtc make[3]: Leaving directory '/builddir/build/BUILD/varnish-modules-0.21.0/src' make[3]: Entering directory '/builddir/build/BUILD/varnish-modules-0.21.0/src' PASS: tests/str/test02.vtc make[3]: Leaving directory '/builddir/build/BUILD/varnish-modules-0.21.0/src' make[3]: Entering directory '/builddir/build/BUILD/varnish-modules-0.21.0/src' PASS: tests/saintmode/test02.vtc make[3]: Leaving directory '/builddir/build/BUILD/varnish-modules-0.21.0/src' make[3]: Entering directory '/builddir/build/BUILD/varnish-modules-0.21.0/src' PASS: tests/str/test01.vtc make[3]: Leaving directory '/builddir/build/BUILD/varnish-modules-0.21.0/src' make[3]: Entering directory '/builddir/build/BUILD/varnish-modules-0.21.0/src' PASS: tests/saintmode/test04.vtc make[3]: Leaving directory '/builddir/build/BUILD/varnish-modules-0.21.0/src' make[3]: Entering directory '/builddir/build/BUILD/varnish-modules-0.21.0/src' FAIL: tests/saintmode/test01.vtc make[3]: Leaving directory '/builddir/build/BUILD/varnish-modules-0.21.0/src' make[3]: Entering directory '/builddir/build/BUILD/varnish-modules-0.21.0/src' PASS: tests/tcp/01-dumpinfo.vtc make[3]: Leaving directory '/builddir/build/BUILD/varnish-modules-0.21.0/src' make[3]: Entering directory '/builddir/build/BUILD/varnish-modules-0.21.0/src' PASS: tests/str/test05.vtc make[3]: Leaving directory '/builddir/build/BUILD/varnish-modules-0.21.0/src' make[3]: Entering directory '/builddir/build/BUILD/varnish-modules-0.21.0/src' PASS: tests/str/test06.vtc make[3]: Leaving directory '/builddir/build/BUILD/varnish-modules-0.21.0/src' make[3]: Entering directory '/builddir/build/BUILD/varnish-modules-0.21.0/src' PASS: tests/str/test08.vtc make[3]: Leaving directory '/builddir/build/BUILD/varnish-modules-0.21.0/src' make[3]: Entering directory '/builddir/build/BUILD/varnish-modules-0.21.0/src' PASS: tests/str/test04.vtc make[3]: Leaving directory '/builddir/build/BUILD/varnish-modules-0.21.0/src' make[3]: Entering directory '/builddir/build/BUILD/varnish-modules-0.21.0/src' PASS: tests/str/test03.vtc make[3]: Leaving directory '/builddir/build/BUILD/varnish-modules-0.21.0/src' make[3]: Entering directory '/builddir/build/BUILD/varnish-modules-0.21.0/src' PASS: tests/tcp/03-read-tcpinfo.vtc make[3]: Leaving directory '/builddir/build/BUILD/varnish-modules-0.21.0/src' make[3]: Entering directory '/builddir/build/BUILD/varnish-modules-0.21.0/src' PASS: tests/tcp/02-congestion.vtc make[3]: Leaving directory '/builddir/build/BUILD/varnish-modules-0.21.0/src' make[3]: Entering directory '/builddir/build/BUILD/varnish-modules-0.21.0/src' PASS: tests/var/test03.vtc make[3]: Leaving directory '/builddir/build/BUILD/varnish-modules-0.21.0/src' make[3]: Entering directory '/builddir/build/BUILD/varnish-modules-0.21.0/src' PASS: tests/tcp/04-pacing.vtc make[3]: Leaving directory '/builddir/build/BUILD/varnish-modules-0.21.0/src' make[3]: Entering directory '/builddir/build/BUILD/varnish-modules-0.21.0/src' PASS: tests/var/test05.vtc make[3]: Leaving directory '/builddir/build/BUILD/varnish-modules-0.21.0/src' make[3]: Entering directory '/builddir/build/BUILD/varnish-modules-0.21.0/src' PASS: tests/var/test06.vtc make[3]: Leaving directory '/builddir/build/BUILD/varnish-modules-0.21.0/src' make[3]: Entering directory '/builddir/build/BUILD/varnish-modules-0.21.0/src' PASS: tests/var/test01.vtc make[3]: Leaving directory '/builddir/build/BUILD/varnish-modules-0.21.0/src' make[3]: Entering directory '/builddir/build/BUILD/varnish-modules-0.21.0/src' PASS: tests/vsthrottle/test01.vtc make[3]: Leaving directory '/builddir/build/BUILD/varnish-modules-0.21.0/src' make[3]: Entering directory '/builddir/build/BUILD/varnish-modules-0.21.0/src' PASS: tests/var/test02.vtc make[3]: Leaving directory '/builddir/build/BUILD/varnish-modules-0.21.0/src' make[3]: Entering directory '/builddir/build/BUILD/varnish-modules-0.21.0/src' PASS: tests/var/test04.vtc make[3]: Leaving directory '/builddir/build/BUILD/varnish-modules-0.21.0/src' make[3]: Entering directory '/builddir/build/BUILD/varnish-modules-0.21.0/src' PASS: tests/vsthrottle/test02.vtc make[3]: Leaving directory '/builddir/build/BUILD/varnish-modules-0.21.0/src' make[3]: Entering directory '/builddir/build/BUILD/varnish-modules-0.21.0/src' PASS: tests/vsthrottle/test04.vtc make[3]: Leaving directory '/builddir/build/BUILD/varnish-modules-0.21.0/src' make[3]: Entering directory '/builddir/build/BUILD/varnish-modules-0.21.0/src' PASS: tests/xkey/test02.vtc make[3]: Leaving directory '/builddir/build/BUILD/varnish-modules-0.21.0/src' make[3]: Entering directory '/builddir/build/BUILD/varnish-modules-0.21.0/src' PASS: tests/xkey/test01.vtc make[3]: Leaving directory '/builddir/build/BUILD/varnish-modules-0.21.0/src' make[3]: Entering directory '/builddir/build/BUILD/varnish-modules-0.21.0/src' PASS: tests/xkey/test03.vtc make[3]: Leaving directory '/builddir/build/BUILD/varnish-modules-0.21.0/src' make[3]: Entering directory '/builddir/build/BUILD/varnish-modules-0.21.0/src' PASS: tests/vsthrottle/test03.vtc make[3]: Leaving directory '/builddir/build/BUILD/varnish-modules-0.21.0/src' make[3]: Entering directory '/builddir/build/BUILD/varnish-modules-0.21.0/src' PASS: tests/xkey/test06.vtc make[3]: Leaving directory '/builddir/build/BUILD/varnish-modules-0.21.0/src' make[3]: Entering directory '/builddir/build/BUILD/varnish-modules-0.21.0/src' PASS: tests/xkey/test04.vtc make[3]: Leaving directory '/builddir/build/BUILD/varnish-modules-0.21.0/src' make[3]: Entering directory '/builddir/build/BUILD/varnish-modules-0.21.0/src' PASS: tests/xkey/test05.vtc make[3]: Leaving directory '/builddir/build/BUILD/varnish-modules-0.21.0/src' make[3]: Entering directory '/builddir/build/BUILD/varnish-modules-0.21.0/src' PASS: tests/xkey/test07.vtc make[3]: Leaving directory '/builddir/build/BUILD/varnish-modules-0.21.0/src' make[3]: Entering directory '/builddir/build/BUILD/varnish-modules-0.21.0/src' PASS: tests/xkey/test08.vtc make[3]: Leaving directory '/builddir/build/BUILD/varnish-modules-0.21.0/src' make[3]: Entering directory '/builddir/build/BUILD/varnish-modules-0.21.0/src' PASS: tests/xkey/test09.vtc make[3]: Leaving directory '/builddir/build/BUILD/varnish-modules-0.21.0/src' make[3]: Entering directory '/builddir/build/BUILD/varnish-modules-0.21.0/src' PASS: tests/xkey/test10.vtc make[3]: Leaving directory '/builddir/build/BUILD/varnish-modules-0.21.0/src' make[3]: Entering directory '/builddir/build/BUILD/varnish-modules-0.21.0/src' PASS: tests/xkey/test13.vtc make[3]: Leaving directory '/builddir/build/BUILD/varnish-modules-0.21.0/src' make[3]: Entering directory '/builddir/build/BUILD/varnish-modules-0.21.0/src' PASS: tests/xkey/test12.vtc make[3]: Leaving directory '/builddir/build/BUILD/varnish-modules-0.21.0/src' make[3]: Entering directory '/builddir/build/BUILD/varnish-modules-0.21.0/src' FAIL: tests/xkey/test11.vtc make[3]: Leaving directory '/builddir/build/BUILD/varnish-modules-0.21.0/src' make[3]: Entering directory '/builddir/build/BUILD/varnish-modules-0.21.0/src' ================================================ varnish-modules 0.21.0: src/test-suite.log ================================================ # TOTAL: 56 # PASS: 54 # SKIP: 0 # XFAIL: 0 # FAIL: 2 # XPASS: 0 # ERROR: 0 .. contents:: :depth: 2 FAIL: tests/saintmode/test01 ============================ **** dT 0.005 * top TEST ./tests/saintmode/test01.vtc starting **** dT 0.008 **** top extmacro def pkg_version=7.2.1 **** top extmacro def pkg_branch=7.2 **** top extmacro def pwd=/builddir/build/BUILD/varnish-modules-0.21.0/src **** top extmacro def date(...) **** top extmacro def string(...) **** top extmacro def vmod_builddir=/builddir/build/BUILD/varnish-modules-0.21.0/src **** top extmacro def vmod_directors=directors from "/usr/lib64/varnish/vmods/libvmod_directors.so" **** top extmacro def localhost=127.0.0.1 **** top extmacro def bad_backend=127.0.0.1:40567 **** top extmacro def listen_addr=127.0.0.1:0 **** top extmacro def bad_ip=192.0.2.255 **** dT 0.011 **** top macro def testdir=/builddir/build/BUILD/varnish-modules-0.21.0/src/./tests/saintmode **** top macro def tmpdir=/tmp/vtc.1163146.09587189 **** dT 0.017 ** top === varnishtest "Test saintmode vmod" * top VTEST Test saintmode vmod ** top === server s1 { **** dT 0.021 ** s1 Starting server **** dT 0.025 **** s1 macro def s1_addr=127.0.0.1 **** s1 macro def s1_port=38231 **** s1 macro def s1_sock=127.0.0.1:38231 * s1 Listen on 127.0.0.1:38231 **** dT 0.030 ** top === varnish v1 -vcl+backend { **** dT 0.032 ** s1 Started on 127.0.0.1:38231 (1 iterations) **** dT 0.374 ** v1 Launch *** v1 CMD: cd ${pwd} && exec varnishd -d -n /tmp/vtc.1163146.09587189/v1 -i v1 -l 2m -p auto_restart=off -p syslog_cli_traffic=off -p thread_pool_min=10 -p debug=+vtc_mode -p vsl_mask=+Debug -p h2_initial_window_size=1m -p h2_rx_window_low_water=64k -a '127.0.0.1:0' -M '127.0.0.1 37091' -P /tmp/vtc.1163146.09587189/v1/varnishd.pid *** v1 CMD: cd /builddir/build/BUILD/varnish-modules-0.21.0/src && exec varnishd -d -n /tmp/vtc.1163146.09587189/v1 -i v1 -l 2m -p auto_restart=off -p syslog_cli_traffic=off -p thread_pool_min=10 -p debug=+vtc_mode -p vsl_mask=+Debug -p h2_initial_window_size=1m -p h2_rx_window_low_water=64k -a '127.0.0.1:0' -M '127.0.0.1 37091' -P /tmp/vtc.1163146.09587189/v1/varnishd.pid **** dT 0.379 *** v1 PID: 1163181 **** dT 0.380 **** v1 macro def v1_pid=1163181 **** v1 macro def v1_name=/tmp/vtc.1163146.09587189/v1 **** dT 1.603 *** v1 debug|Debug: Version: varnish-7.2.1 revision 399fa7ed46d68f4c4f42a8fd2748339750d99a8b **** dT 1.604 *** v1 debug|Debug: Platform: Linux,6.2.15-300.0.riscv64.fc38.riscv64,riscv64,-jnone,-sdefault,-sdefault,-hcritbit **** dT 1.606 *** v1 debug|200 335 *** v1 debug|----------------------------- *** v1 debug|Varnish Cache CLI 1.0 *** v1 debug|----------------------------- *** v1 debug|Linux,6.2.15-300.0.riscv64.fc38.riscv64,riscv64,-jnone,-sdefault,-sdefault,-hcritbit *** v1 debug|varnish-7.2.1 revision 399fa7ed46d68f4c4f42a8fd2748339750d99a8b *** v1 debug| *** v1 debug|Type 'help' for command list. *** v1 debug|Type 'quit' to close CLI session. *** v1 debug|Type 'start' to launch worker process. *** v1 debug| **** dT 1.614 **** v1 CLIPOLL 1 0x1 0x0 0x0 *** v1 CLI connection fd = 6 **** dT 1.632 *** v1 CLI RX 107 **** v1 CLI RX|muvcfxyndcscymnrwpbduaxjvtblrtyn **** v1 CLI RX| **** v1 CLI RX|Authentication required. **** dT 1.648 **** v1 CLI TX|auth 0993bb736976b0dcccecd93dbd72ce29efb1b83691c21df6435c8168163d039d **** dT 1.667 *** v1 CLI RX 200 **** dT 1.668 **** v1 CLI RX|----------------------------- **** v1 CLI RX|Varnish Cache CLI 1.0 **** v1 CLI RX|----------------------------- **** v1 CLI RX|Linux,6.2.15-300.0.riscv64.fc38.riscv64,riscv64,-jnone,-sdefault,-sdefault,-hcritbit **** v1 CLI RX|varnish-7.2.1 revision 399fa7ed46d68f4c4f42a8fd2748339750d99a8b **** v1 CLI RX| **** v1 CLI RX|Type 'help' for command list. **** v1 CLI RX|Type 'quit' to close CLI session. **** v1 CLI RX|Type 'start' to launch worker process. **** dT 1.679 **** v1 CLI TX|vcl.inline vcl1 << %XJEIFLH|)Xspa8P **** v1 CLI TX|vcl 4.1; **** v1 CLI TX|backend s1 { .host = "127.0.0.1"; .port = "38231"; } **** v1 CLI TX| **** v1 CLI TX| **** v1 CLI TX|\timport saintmode from "/builddir/build/BUILD/varnish-modules-0.21.0/src/.libs/libvmod_saintmode.so"; **** v1 CLI TX| **** v1 CLI TX|\tsub vcl_init { **** v1 CLI TX|\t\tnew sm = saintmode.saintmode(s1, 3); **** v1 CLI TX|\t} **** v1 CLI TX| **** v1 CLI TX|\tsub vcl_recv { **** v1 CLI TX|\t\treturn (pass); **** v1 CLI TX|\t} **** v1 CLI TX| **** v1 CLI TX|\tsub vcl_backend_fetch { **** v1 CLI TX|\t\tset bereq.backend = sm.backend(); **** v1 CLI TX|\t} **** v1 CLI TX| **** v1 CLI TX|\tsub vcl_backend_response { **** v1 CLI TX|\t\tif (beresp.http.Saint == "yes") { **** v1 CLI TX|\t\t\tsaintmode.blacklist(0.5s); **** v1 CLI TX|\t\t\treturn (retry); # -> 503 **** v1 CLI TX|\t\t} **** v1 CLI TX|\t} **** v1 CLI TX| **** v1 CLI TX|\tsub vcl_deliver { **** v1 CLI TX|\t\tset resp.http.count = sm.blacklist_count(); **** v1 CLI TX|\t} **** v1 CLI TX| **** v1 CLI TX| **** v1 CLI TX|%XJEIFLH|)Xspa8P **** dT 1.794 *** v1 vsl|No VSL chunk found (child not started ?) **** dT 1.895 *** v1 vsl|No VSL chunk found (child not started ?) **** dT 1.996 *** v1 vsl|No VSL chunk found (child not started ?) **** dT 2.104 *** v1 vsl|No VSL chunk found (child not started ?) **** dT 2.206 *** v1 vsl|No VSL chunk found (child not started ?) **** dT 2.307 *** v1 vsl|No VSL chunk found (child not started ?) **** dT 2.409 *** v1 vsl|No VSL chunk found (child not started ?) **** dT 2.510 *** v1 vsl|No VSL chunk found (child not started ?) **** dT 2.612 *** v1 vsl|No VSL chunk found (child not started ?) **** dT 2.945 *** v1 vsl|No VSL chunk found (child not started ?) **** dT 3.049 *** v1 vsl|No VSL chunk found (child not started ?) **** dT 3.151 *** v1 vsl|No VSL chunk found (child not started ?) **** dT 3.252 *** v1 vsl|No VSL chunk found (child not started ?) **** dT 3.353 *** v1 vsl|No VSL chunk found (child not started ?) **** dT 3.455 *** v1 vsl|No VSL chunk found (child not started ?) **** dT 3.556 *** v1 vsl|No VSL chunk found (child not started ?) **** dT 3.658 *** v1 vsl|No VSL chunk found (child not started ?) **** dT 3.767 *** v1 vsl|No VSL chunk found (child not started ?) **** dT 3.869 *** v1 vsl|No VSL chunk found (child not started ?) **** dT 3.970 *** v1 vsl|No VSL chunk found (child not started ?) **** dT 4.071 *** v1 vsl|No VSL chunk found (child not started ?) **** dT 4.173 *** v1 vsl|No VSL chunk found (child not started ?) **** dT 4.274 *** v1 vsl|No VSL chunk found (child not started ?) **** dT 4.375 *** v1 vsl|No VSL chunk found (child not started ?) **** dT 4.477 *** v1 vsl|No VSL chunk found (child not started ?) **** dT 4.578 *** v1 vsl|No VSL chunk found (child not started ?) **** dT 4.680 *** v1 vsl|No VSL chunk found (child not started ?) **** dT 4.781 *** v1 vsl|No VSL chunk found (child not started ?) **** dT 4.883 *** v1 vsl|No VSL chunk found (child not started ?) **** dT 4.984 *** v1 vsl|No VSL chunk found (child not started ?) **** dT 5.085 *** v1 vsl|No VSL chunk found (child not started ?) **** dT 5.187 *** v1 vsl|No VSL chunk found (child not started ?) **** dT 5.289 *** v1 vsl|No VSL chunk found (child not started ?) **** dT 5.390 *** v1 vsl|No VSL chunk found (child not started ?) **** dT 5.491 *** v1 vsl|No VSL chunk found (child not started ?) **** dT 5.593 *** v1 vsl|No VSL chunk found (child not started ?) **** dT 5.694 *** v1 vsl|No VSL chunk found (child not started ?) **** dT 5.796 *** v1 vsl|No VSL chunk found (child not started ?) **** dT 5.897 *** v1 vsl|No VSL chunk found (child not started ?) **** dT 5.999 *** v1 vsl|No VSL chunk found (child not started ?) **** dT 6.100 *** v1 vsl|No VSL chunk found (child not started ?) **** dT 6.201 *** v1 vsl|No VSL chunk found (child not started ?) **** dT 6.303 *** v1 vsl|No VSL chunk found (child not started ?) **** dT 6.404 *** v1 vsl|No VSL chunk found (child not started ?) **** dT 6.505 *** v1 vsl|No VSL chunk found (child not started ?) **** dT 6.607 *** v1 vsl|No VSL chunk found (child not started ?) **** dT 6.709 *** v1 vsl|No VSL chunk found (child not started ?) **** dT 6.810 *** v1 vsl|No VSL chunk found (child not started ?) **** dT 6.911 *** v1 vsl|No VSL chunk found (child not started ?) **** dT 7.013 *** v1 vsl|No VSL chunk found (child not started ?) **** dT 7.114 *** v1 vsl|No VSL chunk found (child not started ?) **** dT 7.216 *** v1 vsl|No VSL chunk found (child not started ?) **** dT 7.317 *** v1 vsl|No VSL chunk found (child not started ?) **** dT 7.419 *** v1 vsl|No VSL chunk found (child not started ?) **** dT 7.520 *** v1 vsl|No VSL chunk found (child not started ?) **** dT 7.622 *** v1 vsl|No VSL chunk found (child not started ?) **** dT 7.723 *** v1 vsl|No VSL chunk found (child not started ?) **** dT 7.825 *** v1 vsl|No VSL chunk found (child not started ?) **** dT 7.926 *** v1 vsl|No VSL chunk found (child not started ?) **** dT 8.028 *** v1 vsl|No VSL chunk found (child not started ?) **** dT 8.130 *** v1 vsl|No VSL chunk found (child not started ?) **** dT 8.231 *** v1 vsl|No VSL chunk found (child not started ?) **** dT 8.332 *** v1 vsl|No VSL chunk found (child not started ?) **** dT 8.434 *** v1 vsl|No VSL chunk found (child not started ?) **** dT 8.535 *** v1 vsl|No VSL chunk found (child not started ?) **** dT 8.637 *** v1 vsl|No VSL chunk found (child not started ?) **** dT 8.739 *** v1 vsl|No VSL chunk found (child not started ?) **** dT 8.840 *** v1 vsl|No VSL chunk found (child not started ?) **** dT 8.941 *** v1 vsl|No VSL chunk found (child not started ?) **** dT 9.043 *** v1 vsl|No VSL chunk found (child not started ?) **** dT 9.144 *** v1 vsl|No VSL chunk found (child not started ?) **** dT 9.246 *** v1 vsl|No VSL chunk found (child not started ?) **** dT 9.347 *** v1 vsl|No VSL chunk found (child not started ?) **** dT 9.449 *** v1 vsl|No VSL chunk found (child not started ?) **** dT 9.550 *** v1 vsl|No VSL chunk found (child not started ?) **** dT 9.651 *** v1 vsl|No VSL chunk found (child not started ?) **** dT 9.753 *** v1 vsl|No VSL chunk found (child not started ?) **** dT 9.854 *** v1 vsl|No VSL chunk found (child not started ?) **** dT 9.956 *** v1 vsl|No VSL chunk found (child not started ?) **** dT 10.057 *** v1 vsl|No VSL chunk found (child not started ?) **** dT 10.159 *** v1 vsl|No VSL chunk found (child not started ?) **** dT 10.261 *** v1 vsl|No VSL chunk found (child not started ?) **** dT 10.362 *** v1 vsl|No VSL chunk found (child not started ?) **** dT 10.464 *** v1 vsl|No VSL chunk found (child not started ?) **** dT 10.565 *** v1 vsl|No VSL chunk found (child not started ?) **** dT 10.667 *** v1 vsl|No VSL chunk found (child not started ?) **** dT 10.769 *** v1 vsl|No VSL chunk found (child not started ?) **** dT 10.870 *** v1 vsl|No VSL chunk found (child not started ?) **** dT 10.972 *** v1 vsl|No VSL chunk found (child not started ?) **** dT 11.082 *** v1 vsl|No VSL chunk found (child not started ?) **** dT 11.184 *** v1 vsl|No VSL chunk found (child not started ?) **** dT 11.285 *** v1 vsl|No VSL chunk found (child not started ?) **** dT 11.386 *** v1 vsl|No VSL chunk found (child not started ?) **** dT 11.488 *** v1 vsl|No VSL chunk found (child not started ?) **** dT 11.590 *** v1 vsl|No VSL chunk found (child not started ?) **** dT 11.691 *** v1 vsl|No VSL chunk found (child not started ?) **** dT 11.792 *** v1 vsl|No VSL chunk found (child not started ?) **** dT 11.894 *** v1 vsl|No VSL chunk found (child not started ?) **** dT 11.995 *** v1 vsl|No VSL chunk found (child not started ?) **** dT 12.097 *** v1 vsl|No VSL chunk found (child not started ?) **** dT 12.198 *** v1 vsl|No VSL chunk found (child not started ?) **** dT 12.300 *** v1 vsl|No VSL chunk found (child not started ?) **** dT 12.402 *** v1 vsl|No VSL chunk found (child not started ?) **** dT 12.503 *** v1 vsl|No VSL chunk found (child not started ?) **** dT 12.605 *** v1 vsl|No VSL chunk found (child not started ?) **** dT 12.706 *** v1 vsl|No VSL chunk found (child not started ?) **** dT 12.808 *** v1 vsl|No VSL chunk found (child not started ?) **** dT 12.909 *** v1 vsl|No VSL chunk found (child not started ?) **** dT 13.011 *** v1 vsl|No VSL chunk found (child not started ?) **** dT 13.112 *** v1 vsl|No VSL chunk found (child not started ?) **** dT 13.214 *** v1 vsl|No VSL chunk found (child not started ?) **** dT 13.315 *** v1 vsl|No VSL chunk found (child not started ?) **** dT 13.416 *** v1 vsl|No VSL chunk found (child not started ?) **** dT 13.518 *** v1 vsl|No VSL chunk found (child not started ?) **** dT 13.620 *** v1 vsl|No VSL chunk found (child not started ?) **** dT 13.721 *** v1 vsl|No VSL chunk found (child not started ?) **** dT 13.822 *** v1 vsl|No VSL chunk found (child not started ?) **** dT 13.923 *** v1 vsl|No VSL chunk found (child not started ?) **** dT 14.026 *** v1 vsl|No VSL chunk found (child not started ?) **** dT 14.127 *** v1 vsl|No VSL chunk found (child not started ?) **** dT 14.228 *** v1 vsl|No VSL chunk found (child not started ?) **** dT 14.329 *** v1 vsl|No VSL chunk found (child not started ?) **** dT 14.431 *** v1 vsl|No VSL chunk found (child not started ?) **** dT 14.535 *** v1 vsl|No VSL chunk found (child not started ?) **** dT 14.637 *** v1 vsl|No VSL chunk found (child not started ?) **** dT 14.738 *** v1 vsl|No VSL chunk found (child not started ?) **** dT 14.839 *** v1 vsl|No VSL chunk found (child not started ?) **** dT 14.941 *** v1 vsl|No VSL chunk found (child not started ?) **** dT 15.042 *** v1 vsl|No VSL chunk found (child not started ?) **** dT 15.143 *** v1 vsl|No VSL chunk found (child not started ?) **** dT 15.245 *** v1 vsl|No VSL chunk found (child not started ?) **** dT 15.349 *** v1 vsl|No VSL chunk found (child not started ?) **** dT 15.451 *** v1 vsl|No VSL chunk found (child not started ?) **** dT 15.552 *** v1 vsl|No VSL chunk found (child not started ?) **** dT 15.653 *** v1 vsl|No VSL chunk found (child not started ?) **** dT 15.755 *** v1 vsl|No VSL chunk found (child not started ?) **** dT 15.856 *** v1 vsl|No VSL chunk found (child not started ?) **** dT 15.958 *** v1 vsl|No VSL chunk found (child not started ?) **** dT 16.061 *** v1 vsl|No VSL chunk found (child not started ?) **** dT 16.162 *** v1 vsl|No VSL chunk found (child not started ?) **** dT 16.264 *** v1 vsl|No VSL chunk found (child not started ?) **** dT 16.365 *** v1 vsl|No VSL chunk found (child not started ?) **** dT 16.466 *** v1 vsl|No VSL chunk found (child not started ?) **** dT 16.568 *** v1 vsl|No VSL chunk found (child not started ?) **** dT 16.670 *** v1 vsl|No VSL chunk found (child not started ?) **** dT 16.771 *** v1 vsl|No VSL chunk found (child not started ?) **** dT 16.873 *** v1 vsl|No VSL chunk found (child not started ?) **** dT 16.974 *** v1 vsl|No VSL chunk found (child not started ?) **** dT 17.076 *** v1 vsl|No VSL chunk found (child not started ?) **** dT 17.178 *** v1 vsl|No VSL chunk found (child not started ?) **** dT 17.279 *** v1 vsl|No VSL chunk found (child not started ?) **** dT 17.380 *** v1 vsl|No VSL chunk found (child not started ?) **** dT 17.482 *** v1 vsl|No VSL chunk found (child not started ?) **** dT 17.583 *** v1 vsl|No VSL chunk found (child not started ?) **** dT 17.685 *** v1 vsl|No VSL chunk found (child not started ?) **** dT 17.786 *** v1 vsl|No VSL chunk found (child not started ?) **** dT 17.890 *** v1 vsl|No VSL chunk found (child not started ?) **** dT 17.991 *** v1 vsl|No VSL chunk found (child not started ?) **** dT 18.092 *** v1 vsl|No VSL chunk found (child not started ?) **** dT 18.194 *** v1 vsl|No VSL chunk found (child not started ?) **** dT 18.295 *** v1 vsl|No VSL chunk found (child not started ?) **** dT 18.398 *** v1 vsl|No VSL chunk found (child not started ?) **** dT 18.499 *** v1 vsl|No VSL chunk found (child not started ?) **** dT 18.601 *** v1 vsl|No VSL chunk found (child not started ?) **** dT 18.707 *** v1 vsl|No VSL chunk found (child not started ?) **** dT 18.808 *** v1 vsl|No VSL chunk found (child not started ?) **** dT 18.910 *** v1 vsl|No VSL chunk found (child not started ?) **** dT 19.012 *** v1 vsl|No VSL chunk found (child not started ?) **** dT 19.113 *** v1 vsl|No VSL chunk found (child not started ?) **** dT 19.215 *** v1 vsl|No VSL chunk found (child not started ?) **** dT 19.316 *** v1 vsl|No VSL chunk found (child not started ?) **** dT 19.418 *** v1 vsl|No VSL chunk found (child not started ?) **** dT 19.520 *** v1 vsl|No VSL chunk found (child not started ?) **** dT 19.621 *** v1 vsl|No VSL chunk found (child not started ?) **** dT 19.723 *** v1 vsl|No VSL chunk found (child not started ?) **** dT 19.824 *** v1 vsl|No VSL chunk found (child not started ?) **** dT 19.926 *** v1 vsl|No VSL chunk found (child not started ?) **** dT 20.027 *** v1 vsl|No VSL chunk found (child not started ?) **** dT 20.129 *** v1 vsl|No VSL chunk found (child not started ?) **** dT 20.230 *** v1 vsl|No VSL chunk found (child not started ?) **** dT 20.332 *** v1 vsl|No VSL chunk found (child not started ?) **** dT 20.433 *** v1 vsl|No VSL chunk found (child not started ?) **** dT 20.535 *** v1 vsl|No VSL chunk found (child not started ?) **** dT 20.636 *** v1 vsl|No VSL chunk found (child not started ?) **** dT 20.738 *** v1 vsl|No VSL chunk found (child not started ?) **** dT 20.839 *** v1 vsl|No VSL chunk found (child not started ?) **** dT 20.941 *** v1 vsl|No VSL chunk found (child not started ?) **** dT 21.042 *** v1 vsl|No VSL chunk found (child not started ?) **** dT 21.144 *** v1 vsl|No VSL chunk found (child not started ?) **** dT 21.245 *** v1 vsl|No VSL chunk found (child not started ?) **** dT 21.347 *** v1 vsl|No VSL chunk found (child not started ?) **** dT 21.448 *** v1 vsl|No VSL chunk found (child not started ?) **** dT 21.550 *** v1 vsl|No VSL chunk found (child not started ?) **** dT 21.651 *** v1 vsl|No VSL chunk found (child not started ?) **** dT 21.753 *** v1 vsl|No VSL chunk found (child not started ?) **** dT 21.854 *** v1 vsl|No VSL chunk found (child not started ?) **** dT 21.956 *** v1 vsl|No VSL chunk found (child not started ?) **** dT 22.057 *** v1 vsl|No VSL chunk found (child not started ?) **** dT 22.159 *** v1 vsl|No VSL chunk found (child not started ?) **** dT 22.260 *** v1 vsl|No VSL chunk found (child not started ?) **** dT 22.362 *** v1 vsl|No VSL chunk found (child not started ?) **** dT 22.463 *** v1 vsl|No VSL chunk found (child not started ?) **** dT 22.564 *** v1 vsl|No VSL chunk found (child not started ?) **** dT 22.666 *** v1 vsl|No VSL chunk found (child not started ?) **** dT 22.768 *** v1 vsl|No VSL chunk found (child not started ?) **** dT 22.869 *** v1 vsl|No VSL chunk found (child not started ?) **** dT 22.970 *** v1 vsl|No VSL chunk found (child not started ?) **** dT 23.072 *** v1 vsl|No VSL chunk found (child not started ?) **** dT 23.173 *** v1 vsl|No VSL chunk found (child not started ?) **** dT 23.275 *** v1 vsl|No VSL chunk found (child not started ?) **** dT 23.376 *** v1 vsl|No VSL chunk found (child not started ?) **** dT 23.478 *** v1 vsl|No VSL chunk found (child not started ?) **** dT 23.579 *** v1 vsl|No VSL chunk found (child not started ?) **** dT 23.681 *** v1 vsl|No VSL chunk found (child not started ?) **** dT 23.782 *** v1 vsl|No VSL chunk found (child not started ?) **** dT 23.884 *** v1 vsl|No VSL chunk found (child not started ?) **** dT 23.985 *** v1 vsl|No VSL chunk found (child not started ?) **** dT 24.086 *** v1 vsl|No VSL chunk found (child not started ?) **** dT 24.188 *** v1 vsl|No VSL chunk found (child not started ?) **** dT 24.289 *** v1 vsl|No VSL chunk found (child not started ?) **** dT 24.391 *** v1 vsl|No VSL chunk found (child not started ?) **** dT 24.492 *** v1 vsl|No VSL chunk found (child not started ?) **** dT 24.593 *** v1 vsl|No VSL chunk found (child not started ?) **** dT 24.695 *** v1 vsl|No VSL chunk found (child not started ?) **** dT 24.796 *** v1 vsl|No VSL chunk found (child not started ?) **** dT 24.898 *** v1 vsl|No VSL chunk found (child not started ?) **** dT 24.999 *** v1 vsl|No VSL chunk found (child not started ?) **** dT 25.101 *** v1 vsl|No VSL chunk found (child not started ?) **** dT 25.202 *** v1 vsl|No VSL chunk found (child not started ?) **** dT 25.303 *** v1 vsl|No VSL chunk found (child not started ?) **** dT 25.405 *** v1 vsl|No VSL chunk found (child not started ?) **** dT 25.559 *** v1 vsl|No VSL chunk found (child not started ?) **** dT 25.660 *** v1 vsl|No VSL chunk found (child not started ?) **** dT 25.762 *** v1 vsl|No VSL chunk found (child not started ?) **** dT 25.863 *** v1 vsl|No VSL chunk found (child not started ?) **** dT 25.966 *** v1 vsl|No VSL chunk found (child not started ?) **** dT 26.068 *** v1 vsl|No VSL chunk found (child not started ?) **** dT 26.171 *** v1 vsl|No VSL chunk found (child not started ?) **** dT 26.272 *** v1 vsl|No VSL chunk found (child not started ?) **** dT 26.373 *** v1 vsl|No VSL chunk found (child not started ?) **** dT 26.477 *** v1 vsl|No VSL chunk found (child not started ?) **** dT 26.578 *** v1 vsl|No VSL chunk found (child not started ?) **** dT 26.680 *** v1 vsl|No VSL chunk found (child not started ?) **** dT 26.781 *** v1 vsl|No VSL chunk found (child not started ?) **** dT 26.883 *** v1 vsl|No VSL chunk found (child not started ?) **** dT 26.984 *** v1 vsl|No VSL chunk found (child not started ?) **** dT 27.086 *** v1 vsl|No VSL chunk found (child not started ?) **** dT 27.092 *** v1 CLI RX 200 **** dT 27.093 **** v1 CLI RX|VCL compiled. **** v1 CLI TX|vcl.use vcl1 **** dT 27.107 *** v1 CLI RX 200 **** v1 CLI RX|VCL 'vcl1' now active **** dT 27.108 ** v1 Start **** v1 CLI TX|start **** dT 27.188 *** v1 vsl|No VSL chunk found (child not started ?) **** dT 27.290 *** v1 vsl|No VSL chunk found (child not started ?) **** dT 27.390 *** v1 debug|Debug: Child (1163618) Started **** dT 27.394 *** v1 vsl|No VSL chunk found (child not started ?) **** dT 27.669 *** v1 debug|Child launched OK **** dT 27.705 **** v1 vsl| 0 CLI - Rd vcl.load "vcl1" vcl_vcl1.1691422476.112373/vgc.so 1auto **** dT 27.779 *** v1 CLI RX 200 *** v1 wait-running **** v1 CLI TX|status **** dT 27.780 *** v1 debug|Info: Child (1163618) said Child starts **** dT 27.784 *** v1 CLI RX 200 **** v1 CLI RX|Child in state running **** v1 CLI TX|debug.listen_address **** dT 27.819 **** v1 vsl| 0 CLI - Wr 200 52 Loaded "vcl_vcl1.1691422476.112373/vgc.so" as "vcl1" **** v1 vsl| 0 CLI - Rd vcl.use "vcl1" **** v1 vsl| 0 CLI - Wr 200 0 **** dT 27.820 **** v1 vsl| 0 CLI - Rd start **** v1 vsl| 0 Debug - sockopt: Setting SO_LINGER for a0=127.0.0.1:43533 **** v1 vsl| 0 Debug - sockopt: Setting SO_KEEPALIVE for a0=127.0.0.1:43533 **** v1 vsl| 0 Debug - sockopt: Setting SO_SNDTIMEO for a0=127.0.0.1:43533 **** v1 vsl| 0 Debug - sockopt: Setting SO_RCVTIMEO for a0=127.0.0.1:43533 **** v1 vsl| 0 Debug - sockopt: Setting TCP_NODELAY for a0=127.0.0.1:43533 **** v1 vsl| 0 Debug - sockopt: Setting TCP_KEEPIDLE for a0=127.0.0.1:43533 **** v1 vsl| 0 Debug - sockopt: Setting TCP_KEEPCNT for a0=127.0.0.1:43533 **** v1 vsl| 0 Debug - sockopt: Setting TCP_KEEPINTVL for a0=127.0.0.1:43533 **** v1 vsl| 0 CLI - Wr 200 0 **** dT 27.834 *** v1 CLI RX 200 **** dT 27.835 **** v1 CLI RX|a0 127.0.0.1 43533 **** v1 CLI TX|debug.xid 999 **** dT 27.882 *** v1 CLI RX 200 **** v1 CLI RX|XID is 999 chunk 1 **** v1 CLI TX|debug.listen_address **** dT 27.922 **** v1 vsl| 0 CLI - Rd debug.listen_address **** v1 vsl| 0 CLI - Wr 200 19 a0 127.0.0.1 43533 **** v1 vsl| 0 CLI - Rd debug.xid 999 **** v1 vsl| 0 CLI - Wr 200 18 XID is 999 chunk 1 **** dT 27.941 *** v1 CLI RX 200 **** v1 CLI RX|a0 127.0.0.1 43533 ** v1 Listen on 127.0.0.1 43533 **** dT 27.942 **** v1 macro def v1_addr=127.0.0.1 **** v1 macro def v1_port=43533 **** dT 27.943 **** v1 macro def v1_sock=127.0.0.1:43533 **** v1 macro def v1_a0_addr=127.0.0.1 **** v1 macro def v1_a0_port=43533 **** v1 macro def v1_a0_sock=127.0.0.1:43533 ** top === client c1 { **** dT 27.945 ** top === client c1 -run **** dT 27.946 ** c1 Starting client **** dT 27.961 ** c1 Waiting for client **** dT 27.963 ** c1 Started on 127.0.0.1:43533 (1 iterations) *** c1 Connect to 127.0.0.1:43533 **** dT 27.970 *** c1 connected fd 16 from 127.0.0.1 34664 to 127.0.0.1:43533 **** dT 27.990 ** c1 === txreq -url "/a" **** c1 txreq|GET /a HTTP/1.1\r **** c1 txreq|Host: 127.0.0.1\r **** c1 txreq|\r **** dT 27.991 ** c1 === rxresp **** dT 28.012 *** s1 accepted fd 4 127.0.0.1 59952 **** dT 28.014 ** s1 === rxreq **** dT 28.023 **** v1 vsl| 0 CLI - Rd debug.listen_address **** v1 vsl| 0 CLI - Wr 200 19 a0 127.0.0.1 43533 **** v1 vsl| 1000 Begin c sess 0 HTTP/1 **** v1 vsl| 1000 SessOpen c 127.0.0.1 34664 a0 127.0.0.1 43533 1691422502.401111 22 **** dT 28.024 **** v1 vsl| 1000 Debug c sockopt: SO_LINGER may be inherited for a0=127.0.0.1:43533 **** v1 vsl| 1000 Debug c sockopt: SO_KEEPALIVE may be inherited for a0=127.0.0.1:43533 **** v1 vsl| 1000 Debug c sockopt: SO_SNDTIMEO may be inherited for a0=127.0.0.1:43533 **** v1 vsl| 1000 Debug c sockopt: SO_RCVTIMEO may be inherited for a0=127.0.0.1:43533 **** v1 vsl| 1000 Debug c sockopt: TCP_NODELAY may be inherited for a0=127.0.0.1:43533 **** v1 vsl| 1000 Debug c sockopt: TCP_KEEPIDLE may be inherited for a0=127.0.0.1:43533 **** v1 vsl| 1000 Debug c sockopt: TCP_KEEPCNT may be inherited for a0=127.0.0.1:43533 **** v1 vsl| 1000 Debug c sockopt: TCP_KEEPINTVL may be inherited for a0=127.0.0.1:43533 **** v1 vsl| 1000 Link c req 1001 rxreq **** dT 28.046 **** s1 rxhdr|GET /a HTTP/1.1\r **** s1 rxhdr|Host: 127.0.0.1\r **** s1 rxhdr|X-Forwarded-For: 127.0.0.1\r **** s1 rxhdr|Via: 1.1 v1 (Varnish/7.2)\r **** s1 rxhdr|X-Varnish: 1002\r **** s1 rxhdr|\r **** s1 rxhdrlen = 108 **** dT 28.047 **** s1 http[ 0] |GET **** s1 http[ 1] |/a **** s1 http[ 2] |HTTP/1.1 **** s1 http[ 3] |Host: 127.0.0.1 **** s1 http[ 4] |X-Forwarded-For: 127.0.0.1 **** s1 http[ 5] |Via: 1.1 v1 (Varnish/7.2) **** s1 http[ 6] |X-Varnish: 1002 **** s1 bodylen = 0 ** s1 === expect req.url == "/a" **** dT 28.048 **** s1 EXPECT req.url (/a) == "/a" match ** s1 === txresp -hdr "Saint: yes" **** dT 28.049 **** s1 txresp|HTTP/1.1 200 OK\r **** s1 txresp|Saint: yes\r **** s1 txresp|Content-Length: 0\r **** s1 txresp|\r ** s1 === accept **** dT 28.061 **** s1 Accepting **** dT 28.126 **** v1 vsl| 1002 Begin b bereq 1001 pass **** v1 vsl| 1002 VCL_use b vcl1 **** v1 vsl| 1002 Timestamp b Start: 1691422502.435049 0.000000 0.000000 **** v1 vsl| 1002 BereqMethod b GET **** v1 vsl| 1002 BereqURL b /a **** v1 vsl| 1002 BereqProtocol b HTTP/1.1 **** dT 28.127 **** v1 vsl| 1002 BereqHeader b Host: 127.0.0.1 **** v1 vsl| 1002 BereqHeader b X-Forwarded-For: 127.0.0.1 **** v1 vsl| 1002 BereqHeader b Via: 1.1 v1 (Varnish/7.2) **** v1 vsl| 1002 BereqHeader b X-Varnish: 1002 **** v1 vsl| 1002 VCL_call b BACKEND_FETCH **** v1 vsl| 1002 VCL_return b fetch **** v1 vsl| 1002 Timestamp b Fetch: 1691422502.438139 0.003089 0.003089 **** v1 vsl| 1002 Timestamp b Connected: 1691422502.442562 0.007513 0.004423 **** v1 vsl| 1002 BackendOpen b 25 s1 127.0.0.1 38231 127.0.0.1 59952 connect **** v1 vsl| 1002 Timestamp b Bereq: 1691422502.445848 0.010798 0.003285 **** v1 vsl| 1002 Timestamp b Beresp: 1691422502.481031 0.045981 0.035182 **** v1 vsl| 1002 BerespProtocol b HTTP/1.1 **** v1 vsl| 1002 BerespStatus b 200 **** v1 vsl| 1002 BerespReason b OK **** v1 vsl| 1002 BerespHeader b Saint: yes **** v1 vsl| 1002 BerespHeader b Content-Length: 0 **** v1 vsl| 1002 BerespHeader b Date: Mon, 07 Aug 2023 15:35:02 GMT **** v1 vsl| 1002 VCL_call b BACKEND_RESPONSE **** v1 vsl| 1002 VCL_Log b saintmode: object put on blacklist for backend s1 for 0.50 seconds **** v1 vsl| 1002 VCL_return b retry **** v1 vsl| 1002 BackendClose b 25 s1 recycle **** v1 vsl| 1002 Timestamp b Retry: 1691422502.502223 0.067173 0.021192 **** v1 vsl| 1002 Link b bereq 1003 retry **** v1 vsl| 1002 End b **** v1 vsl| 1003 Begin b bereq 1002 retry **** v1 vsl| 1003 Timestamp b Start: 1691422502.502223 0.067173 0.000000 **** v1 vsl| 1003 BereqMethod b GET **** v1 vsl| 1003 BereqURL b /a **** v1 vsl| 1003 BereqProtocol b HTTP/1.1 **** v1 vsl| 1003 BereqHeader b Host: 127.0.0.1 **** v1 vsl| 1003 BereqHeader b X-Forwarded-For: 127.0.0.1 **** v1 vsl| 1003 BereqHeader b Via: 1.1 v1 (Varnish/7.2) **** v1 vsl| 1003 BereqHeader b X-Varnish: 1002 **** v1 vsl| 1003 BereqUnset b X-Varnish: 1002 **** v1 vsl| 1003 BereqHeader b X-Varnish: 1003 **** v1 vsl| 1003 VCL_call b BACKEND_FETCH **** v1 vsl| 1003 VCL_return b fetch **** v1 vsl| 1003 Timestamp b Fetch: 1691422502.503013 0.067963 0.000789 **** v1 vsl| 1003 VCL_Log b saintmode: unhealthy: object blacklisted for backend s1 **** v1 vsl| 1003 FetchError b Director sm returned no backend **** v1 vsl| 1003 Timestamp b Beresp: 1691422502.503481 0.068431 0.000468 **** v1 vsl| 1003 Timestamp b Error: 1691422502.503625 0.068575 0.000144 **** dT 28.128 **** v1 vsl| 1003 BerespProtocol b HTTP/1.1 **** v1 vsl| 1003 BerespStatus b 503 **** v1 vsl| 1003 BerespReason b Backend fetch failed **** v1 vsl| 1003 BerespHeader b Date: Mon, 07 Aug 2023 15:35:02 GMT **** v1 vsl| 1003 BerespHeader b Server: Varnish **** v1 vsl| 1003 VCL_call b BACKEND_ERROR **** v1 vsl| 1003 BerespHeader b Content-Type: text/html; charset=utf-8 **** v1 vsl| 1003 BerespHeader b Retry-After: 5 **** v1 vsl| 1003 VCL_return b deliver **** v1 vsl| 1003 Storage b malloc Transient **** v1 vsl| 1003 Length b 281 **** v1 vsl| 1003 BereqAcct b 108 0 108 50 0 50 **** v1 vsl| 1003 End b **** v1 vsl| 1001 Begin c req 1000 rxreq **** v1 vsl| 1001 Timestamp c Start: 1691422502.421977 0.000000 0.000000 **** v1 vsl| 1001 Timestamp c Req: 1691422502.421977 0.000000 0.000000 **** v1 vsl| 1001 VCL_use c vcl1 **** v1 vsl| 1001 ReqStart c 127.0.0.1 34664 a0 **** v1 vsl| 1001 ReqMethod c GET **** v1 vsl| 1001 ReqURL c /a **** v1 vsl| 1001 ReqProtocol c HTTP/1.1 **** v1 vsl| 1001 ReqHeader c Host: 127.0.0.1 **** v1 vsl| 1001 ReqHeader c X-Forwarded-For: 127.0.0.1 **** v1 vsl| 1001 ReqHeader c Via: 1.1 v1 (Varnish/7.2) **** v1 vsl| 1001 VCL_call c RECV **** v1 vsl| 1001 VCL_return c pass **** v1 vsl| 1001 VCL_call c HASH **** v1 vsl| 1001 VCL_return c lookup **** v1 vsl| 1001 VCL_call c PASS **** v1 vsl| 1001 VCL_return c fetch **** v1 vsl| 1001 Link c bereq 1002 pass **** v1 vsl| 1001 Timestamp c Fetch: 1691422502.511434 0.089457 0.089457 **** v1 vsl| 1001 RespProtocol c HTTP/1.1 **** v1 vsl| 1001 RespStatus c 503 **** v1 vsl| 1001 RespReason c Backend fetch failed **** v1 vsl| 1001 RespHeader c Date: Mon, 07 Aug 2023 15:35:02 GMT **** v1 vsl| 1001 RespHeader c Server: Varnish **** v1 vsl| 1001 RespHeader c Content-Type: text/html; charset=utf-8 **** v1 vsl| 1001 RespHeader c Retry-After: 5 **** v1 vsl| 1001 RespHeader c X-Varnish: 1001 **** v1 vsl| 1001 RespHeader c Age: 0 **** v1 vsl| 1001 RespHeader c Via: 1.1 v1 (Varnish/7.2) **** v1 vsl| 1001 VCL_call c DELIVER **** v1 vsl| 1001 RespHeader c count: 1 **** v1 vsl| 1001 VCL_return c deliver **** v1 vsl| 1001 Timestamp c Process: 1691422502.513669 0.091692 0.002234 **** v1 vsl| 1001 Filters c **** v1 vsl| 1001 RespHeader c Content-Length: 281 **** v1 vsl| 1001 RespHeader c Connection: keep-alive **** v1 vsl| 1001 Timestamp c Resp: 1691422502.517448 0.095471 0.003778 **** v1 vsl| 1001 ReqAcct c 36 0 36 254 281 535 **** v1 vsl| 1001 End c **** dT 28.139 **** c1 rxhdr|HTTP/1.1 503 Backend fetch failed\r **** c1 rxhdr|Date: Mon, 07 Aug 2023 15:35:02 GMT\r **** c1 rxhdr|Server: Varnish\r **** c1 rxhdr|Content-Type: text/html; charset=utf-8\r **** c1 rxhdr|Retry-After: 5\r **** c1 rxhdr|X-Varnish: 1001\r **** c1 rxhdr|Age: 0\r **** c1 rxhdr|Via: 1.1 v1 (Varnish/7.2)\r **** c1 rxhdr|count: 1\r **** c1 rxhdr|Content-Length: 281\r **** c1 rxhdr|Connection: keep-alive\r **** c1 rxhdr|\r **** c1 rxhdrlen = 254 **** dT 28.140 **** c1 http[ 0] |HTTP/1.1 **** c1 http[ 1] |503 **** c1 http[ 2] |Backend fetch failed **** c1 http[ 3] |Date: Mon, 07 Aug 2023 15:35:02 GMT **** c1 http[ 4] |Server: Varnish **** c1 http[ 5] |Content-Type: text/html; charset=utf-8 **** c1 http[ 6] |Retry-After: 5 **** c1 http[ 7] |X-Varnish: 1001 **** c1 http[ 8] |Age: 0 **** c1 http[ 9] |Via: 1.1 v1 (Varnish/7.2) **** c1 http[10] |count: 1 **** c1 http[11] |Content-Length: 281 **** c1 http[12] |Connection: keep-alive **** dT 28.141 **** c1 c-l| **** c1 c-l| **** c1 c-l| **** c1 c-l| 503 Backend fetch failed **** c1 c-l| **** c1 c-l| **** c1 c-l|

Error 503 Backend fetch failed

**** c1 c-l|

Backend fetch failed

**** c1 c-l|

Guru Meditation:

**** c1 c-l|

XID: 1003

**** c1 c-l|
**** c1 c-l|

Varnish cache server

**** c1 c-l| **** c1 c-l| **** c1 bodylen = 281 ** c1 === expect resp.status == 503 **** c1 EXPECT resp.status (503) == "503" match ** c1 === expect resp.http.count == 1 **** dT 28.142 **** c1 EXPECT resp.http.count (1) == "1" match ** c1 === txreq -url "/a" **** c1 txreq|GET /a HTTP/1.1\r **** c1 txreq|Host: 127.0.0.1\r **** c1 txreq|\r **** dT 28.144 ** c1 === rxresp **** dT 28.200 **** c1 rxhdr|HTTP/1.1 503 Backend fetch failed\r **** c1 rxhdr|Date: Mon, 07 Aug 2023 15:35:02 GMT\r **** c1 rxhdr|Server: Varnish\r **** c1 rxhdr|Content-Type: text/html; charset=utf-8\r **** c1 rxhdr|Retry-After: 5\r **** c1 rxhdr|X-Varnish: 1004\r **** c1 rxhdr|Age: 0\r **** c1 rxhdr|Via: 1.1 v1 (Varnish/7.2)\r **** c1 rxhdr|count: 1\r **** c1 rxhdr|Content-Length: 281\r **** c1 rxhdr|Connection: keep-alive\r **** c1 rxhdr|\r **** c1 rxhdrlen = 254 **** c1 http[ 0] |HTTP/1.1 **** c1 http[ 1] |503 **** c1 http[ 2] |Backend fetch failed **** c1 http[ 3] |Date: Mon, 07 Aug 2023 15:35:02 GMT **** c1 http[ 4] |Server: Varnish **** c1 http[ 5] |Content-Type: text/html; charset=utf-8 **** c1 http[ 6] |Retry-After: 5 **** c1 http[ 7] |X-Varnish: 1004 **** c1 http[ 8] |Age: 0 **** c1 http[ 9] |Via: 1.1 v1 (Varnish/7.2) **** c1 http[10] |count: 1 **** c1 http[11] |Content-Length: 281 **** c1 http[12] |Connection: keep-alive **** dT 28.201 **** c1 c-l| **** c1 c-l| **** c1 c-l| **** c1 c-l| 503 Backend fetch failed **** c1 c-l| **** c1 c-l| **** c1 c-l|

Error 503 Backend fetch failed

**** c1 c-l|

Backend fetch failed

**** c1 c-l|

Guru Meditation:

**** c1 c-l|

XID: 1005

**** c1 c-l|
**** c1 c-l|

Varnish cache server

**** c1 c-l| **** c1 c-l| **** c1 bodylen = 281 ** c1 === expect resp.http.count == 1 **** c1 EXPECT resp.http.count (1) == "1" match ** c1 === expect resp.status == 503 **** c1 EXPECT resp.status (503) == "503" match ** c1 === txreq -url "/b" **** c1 txreq|GET /b HTTP/1.1\r **** c1 txreq|Host: 127.0.0.1\r **** c1 txreq|\r **** dT 28.202 ** c1 === rxresp **** dT 28.207 *** s1 Accepted socket fd is 4 ** s1 === rxreq **** dT 28.229 **** s1 rxhdr|GET /b HTTP/1.1\r **** s1 rxhdr|Host: 127.0.0.1\r **** s1 rxhdr|X-Forwarded-For: 127.0.0.1\r **** s1 rxhdr|Via: 1.1 v1 (Varnish/7.2)\r **** s1 rxhdr|X-Varnish: 1007\r **** s1 rxhdr|\r **** s1 rxhdrlen = 108 **** s1 http[ 0] |GET **** s1 http[ 1] |/b **** s1 http[ 2] |HTTP/1.1 **** s1 http[ 3] |Host: 127.0.0.1 **** s1 http[ 4] |X-Forwarded-For: 127.0.0.1 **** s1 http[ 5] |Via: 1.1 v1 (Varnish/7.2) **** dT 28.230 **** s1 http[ 6] |X-Varnish: 1007 **** s1 bodylen = 0 ** s1 === expect req.url == "/b" **** s1 EXPECT req.url (/b) == "/b" match ** s1 === txresp **** s1 txresp|HTTP/1.1 200 OK\r **** s1 txresp|Content-Length: 0\r **** s1 txresp|\r **** v1 vsl| 1000 Link c req 1004 rxreq **** v1 vsl| 1005 Begin b bereq 1004 pass **** v1 vsl| 1005 VCL_use b vcl1 **** v1 vsl| 1005 Timestamp b Start: 1691422502.575474 0.000000 0.000000 **** v1 vsl| 1005 BereqMethod b GET **** v1 vsl| 1005 BereqURL b /a **** v1 vsl| 1005 BereqProtocol b HTTP/1.1 **** v1 vsl| 1005 BereqHeader b Host: 127.0.0.1 **** v1 vsl| 1005 BereqHeader b X-Forwarded-For: 127.0.0.1 **** v1 vsl| 1005 BereqHeader b Via: 1.1 v1 (Varnish/7.2) **** v1 vsl| 1005 BereqHeader b X-Varnish: 1005 **** v1 vsl| 1005 VCL_call b BACKEND_FETCH **** v1 vsl| 1005 VCL_return b fetch **** v1 vsl| 1005 Timestamp b Fetch: 1691422502.575792 0.000318 0.000318 **** v1 vsl| 1005 VCL_Log b saintmode: unhealthy: object blacklisted for backend s1 **** v1 vsl| 1005 FetchError b Director sm returned no backend **** v1 vsl| 1005 Timestamp b Beresp: 1691422502.575845 0.000370 0.000052 **** v1 vsl| 1005 Timestamp b Error: 1691422502.575862 0.000388 0.000017 **** v1 vsl| 1005 BerespProtocol b HTTP/1.1 **** v1 vsl| 1005 BerespStatus b 503 **** v1 vsl| 1005 BerespReason b Backend fetch failed **** v1 vsl| 1005 BerespHeader b Date: Mon, 07 Aug 2023 15:35:02 GMT **** v1 vsl| 1005 BerespHeader b Server: Varnish **** v1 vsl| 1005 VCL_call b BACKEND_ERROR **** dT 28.231 **** v1 vsl| 1005 BerespHeader b Content-Type: text/html; charset=utf-8 **** v1 vsl| 1005 BerespHeader b Retry-After: 5 **** v1 vsl| 1005 VCL_return b deliver **** v1 vsl| 1005 Storage b malloc Transient **** v1 vsl| 1005 Length b 281 **** v1 vsl| 1005 BereqAcct b 0 0 0 0 0 0 **** v1 vsl| 1005 End b **** v1 vsl| 1004 Begin c req 1000 rxreq **** v1 vsl| 1004 Timestamp c Start: 1691422502.574564 0.000000 0.000000 ** s1 === rxreq **** v1 vsl| 1004 Timestamp c Req: 1691422502.574564 0.000000 0.000000 **** v1 vsl| 1004 VCL_use c vcl1 **** v1 vsl| 1004 ReqStart c 127.0.0.1 34664 a0 **** v1 vsl| 1004 ReqMethod c GET **** v1 vsl| 1004 ReqURL c /a **** v1 vsl| 1004 ReqProtocol c HTTP/1.1 **** v1 vsl| 1004 ReqHeader c Host: 127.0.0.1 **** v1 vsl| 1004 ReqHeader c X-Forwarded-For: 127.0.0.1 **** v1 vsl| 1004 ReqHeader c Via: 1.1 v1 (Varnish/7.2) **** v1 vsl| 1004 VCL_call c RECV **** v1 vsl| 1004 VCL_return c pass **** v1 vsl| 1004 VCL_call c HASH **** v1 vsl| 1004 VCL_return c lookup **** v1 vsl| 1004 VCL_call c PASS **** v1 vsl| 1004 VCL_return c fetch **** v1 vsl| 1004 Link c bereq 1005 pass **** v1 vsl| 1004 Timestamp c Fetch: 1691422502.577072 0.002507 0.002507 **** v1 vsl| 1004 RespProtocol c HTTP/1.1 **** v1 vsl| 1004 RespStatus c 503 **** v1 vsl| 1004 RespReason c Backend fetch failed **** v1 vsl| 1004 RespHeader c Date: Mon, 07 Aug 2023 15:35:02 GMT **** v1 vsl| 1004 RespHeader c Server: Varnish **** v1 vsl| 1004 RespHeader c Content-Type: text/html; charset=utf-8 **** v1 vsl| 1004 RespHeader c Retry-After: 5 **** v1 vsl| 1004 RespHeader c X-Varnish: 1004 **** v1 vsl| 1004 RespHeader c Age: 0 **** v1 vsl| 1004 RespHeader c Via: 1.1 v1 (Varnish/7.2) **** v1 vsl| 1004 VCL_call c DELIVER **** v1 vsl| 1004 RespHeader c count: 1 **** v1 vsl| 1004 VCL_return c deliver **** v1 vsl| 1004 Timestamp c Process: 1691422502.577376 0.002811 0.000303 **** v1 vsl| 1004 Filters c **** v1 vsl| 1004 RespHeader c Content-Length: 281 **** v1 vsl| 1004 RespHeader c Connection: keep-alive **** v1 vsl| 1004 Timestamp c Resp: 1691422502.581735 0.007170 0.004358 **** v1 vsl| 1004 ReqAcct c 36 0 36 254 281 535 **** v1 vsl| 1004 End c **** v1 vsl| 1000 Link c req 1006 rxreq **** dT 28.284 **** c1 rxhdr|HTTP/1.1 200 OK\r **** c1 rxhdr|Content-Length: 0\r **** c1 rxhdr|Date: Mon, 07 Aug 2023 15:35:02 GMT\r **** c1 rxhdr|X-Varnish: 1006\r **** c1 rxhdr|Age: 0\r **** c1 rxhdr|Via: 1.1 v1 (Varnish/7.2)\r **** c1 rxhdr|count: 1\r **** c1 rxhdr|Connection: keep-alive\r **** c1 rxhdr|\r **** c1 rxhdrlen = 161 **** c1 http[ 0] |HTTP/1.1 **** c1 http[ 1] |200 **** c1 http[ 2] |OK **** c1 http[ 3] |Content-Length: 0 **** c1 http[ 4] |Date: Mon, 07 Aug 2023 15:35:02 GMT **** c1 http[ 5] |X-Varnish: 1006 **** c1 http[ 6] |Age: 0 **** c1 http[ 7] |Via: 1.1 v1 (Varnish/7.2) **** dT 28.285 **** c1 http[ 8] |count: 1 **** c1 http[ 9] |Connection: keep-alive **** c1 bodylen = 0 ** c1 === expect resp.http.count == 1 **** c1 EXPECT resp.http.count (1) == "1" match ** c1 === expect resp.status == 200 **** c1 EXPECT resp.status (200) == "200" match ** c1 === delay 0.5 **** dT 28.287 *** c1 delaying 0.5 second(s) **** dT 28.333 **** v1 vsl| 1007 Begin b bereq 1006 pass **** v1 vsl| 1007 VCL_use b vcl1 **** v1 vsl| 1007 Timestamp b Start: 1691422502.634537 0.000000 0.000000 **** v1 vsl| 1007 BereqMethod b GET **** v1 vsl| 1007 BereqURL b /b **** v1 vsl| 1007 BereqProtocol b HTTP/1.1 **** v1 vsl| 1007 BereqHeader b Host: 127.0.0.1 **** v1 vsl| 1007 BereqHeader b X-Forwarded-For: 127.0.0.1 **** v1 vsl| 1007 BereqHeader b Via: 1.1 v1 (Varnish/7.2) **** v1 vsl| 1007 BereqHeader b X-Varnish: 1007 **** v1 vsl| 1007 VCL_call b BACKEND_FETCH **** v1 vsl| 1007 VCL_return b fetch **** v1 vsl| 1007 Timestamp b Fetch: 1691422502.634842 0.000305 0.000305 **** v1 vsl| 1007 Timestamp b Connected: 1691422502.636851 0.002314 0.002008 **** v1 vsl| 1007 BackendOpen b 25 s1 127.0.0.1 38231 127.0.0.1 59954 connect **** v1 vsl| 1007 Timestamp b Bereq: 1691422502.638409 0.003872 0.001558 **** v1 vsl| 1007 Timestamp b Beresp: 1691422502.661278 0.026741 0.022868 **** v1 vsl| 1007 BerespProtocol b HTTP/1.1 **** v1 vsl| 1007 BerespStatus b 200 **** v1 vsl| 1007 BerespReason b OK **** v1 vsl| 1007 BerespHeader b Content-Length: 0 **** v1 vsl| 1007 BerespHeader b Date: Mon, 07 Aug 2023 15:35:02 GMT **** v1 vsl| 1007 VCL_call b BACKEND_RESPONSE **** v1 vsl| 1007 VCL_return b deliver **** v1 vsl| 1007 Timestamp b Process: 1691422502.661774 0.027237 0.000495 **** v1 vsl| 1007 Filters b **** v1 vsl| 1007 Storage b malloc Transient **** v1 vsl| 1007 Fetch_Body b 0 none - **** v1 vsl| 1007 BackendClose b 25 s1 recycle **** v1 vsl| 1007 Timestamp b BerespBody: 1691422502.674969 0.040432 0.013194 **** v1 vsl| 1007 Length b 0 **** v1 vsl| 1007 BereqAcct b 108 0 108 38 0 38 **** v1 vsl| 1007 End b **** v1 vsl| 1006 Begin c req 1000 rxreq **** v1 vsl| 1006 Timestamp c Start: 1691422502.633432 0.000000 0.000000 **** v1 vsl| 1006 Timestamp c Req: 1691422502.633432 0.000000 0.000000 **** v1 vsl| 1006 VCL_use c vcl1 **** v1 vsl| 1006 ReqStart c 127.0.0.1 34664 a0 **** v1 vsl| 1006 ReqMethod c GET **** v1 vsl| 1006 ReqURL c /b **** v1 vsl| 1006 ReqProtocol c HTTP/1.1 **** v1 vsl| 1006 ReqHeader c Host: 127.0.0.1 **** v1 vsl| 1006 ReqHeader c X-Forwarded-For: 127.0.0.1 **** v1 vsl| 1006 ReqHeader c Via: 1.1 v1 (Varnish/7.2) **** v1 vsl| 1006 VCL_call c RECV **** v1 vsl| 1006 VCL_return c pass **** v1 vsl| 1006 VCL_call c HASH **** v1 vsl| 1006 VCL_return c lookup **** v1 vsl| 1006 VCL_call c PASS **** dT 28.334 **** v1 vsl| 1006 VCL_return c fetch **** v1 vsl| 1006 Link c bereq 1007 pass **** v1 vsl| 1006 Timestamp c Fetch: 1691422502.675640 0.042207 0.042207 **** v1 vsl| 1006 RespProtocol c HTTP/1.1 **** v1 vsl| 1006 RespStatus c 200 **** v1 vsl| 1006 RespReason c OK **** v1 vsl| 1006 RespHeader c Content-Length: 0 **** v1 vsl| 1006 RespHeader c Date: Mon, 07 Aug 2023 15:35:02 GMT **** v1 vsl| 1006 RespHeader c X-Varnish: 1006 **** v1 vsl| 1006 RespHeader c Age: 0 **** v1 vsl| 1006 RespHeader c Via: 1.1 v1 (Varnish/7.2) **** v1 vsl| 1006 VCL_call c DELIVER **** v1 vsl| 1006 RespHeader c count: 1 **** v1 vsl| 1006 VCL_return c deliver **** v1 vsl| 1006 Timestamp c Process: 1691422502.676129 0.042696 0.000488 **** v1 vsl| 1006 Filters c **** v1 vsl| 1006 RespHeader c Connection: keep-alive **** v1 vsl| 1006 Timestamp c Resp: 1691422502.677799 0.044366 0.001670 **** v1 vsl| 1006 ReqAcct c 36 0 36 161 0 161 **** v1 vsl| 1006 End c **** dT 28.788 ** c1 === txreq -url "/a" **** c1 txreq|GET /a HTTP/1.1\r **** c1 txreq|Host: 127.0.0.1\r **** c1 txreq|\r ** c1 === rxresp **** dT 28.817 **** s1 rxhdr|GET /a HTTP/1.1\r **** s1 rxhdr|Host: 127.0.0.1\r **** s1 rxhdr|X-Forwarded-For: 127.0.0.1\r **** s1 rxhdr|Via: 1.1 v1 (Varnish/7.2)\r **** s1 rxhdr|X-Varnish: 1009\r **** s1 rxhdr|\r **** s1 rxhdrlen = 108 **** s1 http[ 0] |GET **** s1 http[ 1] |/a **** s1 http[ 2] |HTTP/1.1 **** s1 http[ 3] |Host: 127.0.0.1 **** s1 http[ 4] |X-Forwarded-For: 127.0.0.1 **** s1 http[ 5] |Via: 1.1 v1 (Varnish/7.2) **** s1 http[ 6] |X-Varnish: 1009 **** s1 bodylen = 0 ** s1 === expect req.url == "/a" **** s1 EXPECT req.url (/a) == "/a" match ** s1 === txresp **** s1 txresp|HTTP/1.1 200 OK\r **** s1 txresp|Content-Length: 0\r **** s1 txresp|\r **** dT 28.818 ** s1 === rxreq **** dT 28.851 **** v1 vsl| 1000 Link c req 1008 rxreq **** v1 vsl| 1009 Begin b bereq 1008 pass **** v1 vsl| 1009 VCL_use b vcl1 **** v1 vsl| 1009 Timestamp b Start: 1691422503.223404 0.000000 0.000000 **** v1 vsl| 1009 BereqMethod b GET **** v1 vsl| 1009 BereqURL b /a **** v1 vsl| 1009 BereqProtocol b HTTP/1.1 **** v1 vsl| 1009 BereqHeader b Host: 127.0.0.1 **** v1 vsl| 1009 BereqHeader b X-Forwarded-For: 127.0.0.1 **** v1 vsl| 1009 BereqHeader b Via: 1.1 v1 (Varnish/7.2) **** v1 vsl| 1009 BereqHeader b X-Varnish: 1009 **** v1 vsl| 1009 VCL_call b BACKEND_FETCH **** v1 vsl| 1009 VCL_return b fetch **** v1 vsl| 1009 Timestamp b Fetch: 1691422503.223684 0.000279 0.000279 **** v1 vsl| 1009 Timestamp b Connected: 1691422503.223939 0.000535 0.000255 **** v1 vsl| 1009 BackendOpen b 25 s1 127.0.0.1 38231 127.0.0.1 59954 reuse **** dT 28.852 **** v1 vsl| 1009 Timestamp b Bereq: 1691422503.225309 0.001905 0.001370 **** v1 vsl| 1009 Timestamp b Beresp: 1691422503.259081 0.035677 0.033771 **** v1 vsl| 1009 BerespProtocol b HTTP/1.1 **** v1 vsl| 1009 BerespStatus b 200 **** v1 vsl| 1009 BerespReason b OK **** v1 vsl| 1009 BerespHeader b Content-Length: 0 **** v1 vsl| 1009 BerespHeader b Date: Mon, 07 Aug 2023 15:35:03 GMT **** v1 vsl| 1009 VCL_call b BACKEND_RESPONSE **** v1 vsl| 1009 VCL_return b deliver **** v1 vsl| 1009 Timestamp b Process: 1691422503.259301 0.035896 0.000219 **** v1 vsl| 1009 Filters b **** v1 vsl| 1009 Storage b malloc Transient **** v1 vsl| 1009 Fetch_Body b 0 none - **** v1 vsl| 1009 BackendClose b 25 s1 recycle **** v1 vsl| 1009 Timestamp b BerespBody: 1691422503.270414 0.047010 0.011113 **** v1 vsl| 1009 Length b 0 **** v1 vsl| 1009 BereqAcct b 108 0 108 38 0 38 **** v1 vsl| 1009 End b **** v1 vsl| 1008 Begin c req 1000 rxreq **** v1 vsl| 1008 Timestamp c Start: 1691422503.222545 0.000000 0.000000 **** v1 vsl| 1008 Timestamp c Req: 1691422503.222545 0.000000 0.000000 **** v1 vsl| 1008 VCL_use c vcl1 **** v1 vsl| 1008 ReqStart c 127.0.0.1 34664 a0 **** v1 vsl| 1008 ReqMethod c GET **** v1 vsl| 1008 ReqURL c /a **** v1 vsl| 1008 ReqProtocol c HTTP/1.1 **** v1 vsl| 1008 ReqHeader c Host: 127.0.0.1 **** v1 vsl| 1008 ReqHeader c X-Forwarded-For: 127.0.0.1 **** v1 vsl| 1008 ReqHeader c Via: 1.1 v1 (Varnish/7.2) **** v1 vsl| 1008 VCL_call c RECV **** v1 vsl| 1008 VCL_return c pass **** v1 vsl| 1008 VCL_call c HASH **** v1 vsl| 1008 VCL_return c lookup **** v1 vsl| 1008 VCL_call c PASS **** v1 vsl| 1008 VCL_return c fetch **** v1 vsl| 1008 Link c bereq 1009 pass **** v1 vsl| 1008 Timestamp c Fetch: 1691422503.270903 0.048358 0.048358 **** v1 vsl| 1008 RespProtocol c HTTP/1.1 **** v1 vsl| 1008 RespStatus c 200 **** v1 vsl| 1008 RespReason c OK **** v1 vsl| 1008 RespHeader c Content-Length: 0 **** v1 vsl| 1008 RespHeader c Date: Mon, 07 Aug 2023 15:35:03 GMT **** v1 vsl| 1008 RespHeader c X-Varnish: 1008 **** v1 vsl| 1008 RespHeader c Age: 0 **** v1 vsl| 1008 RespHeader c Via: 1.1 v1 (Varnish/7.2) **** v1 vsl| 1008 VCL_call c DELIVER **** v1 vsl| 1008 RespHeader c count: 0 **** v1 vsl| 1008 VCL_return c deliver **** v1 vsl| 1008 Timestamp c Process: 1691422503.271233 0.048688 0.000330 **** v1 vsl| 1008 Filters c **** v1 vsl| 1008 RespHeader c Connection: keep-alive **** v1 vsl| 1008 Timestamp c Resp: 1691422503.272400 0.049854 0.001166 **** v1 vsl| 1008 ReqAcct c 36 0 36 161 0 161 **** v1 vsl| 1008 End c **** dT 28.886 **** c1 rxhdr|HTTP/1.1 200 OK\r **** c1 rxhdr|Content-Length: 0\r **** c1 rxhdr|Date: Mon, 07 Aug 2023 15:35:03 GMT\r **** c1 rxhdr|X-Varnish: 1008\r **** c1 rxhdr|Age: 0\r **** c1 rxhdr|Via: 1.1 v1 (Varnish/7.2)\r **** c1 rxhdr|count: 0\r **** c1 rxhdr|Connection: keep-alive\r **** c1 rxhdr|\r **** dT 28.887 **** c1 rxhdrlen = 161 **** c1 http[ 0] |HTTP/1.1 **** c1 http[ 1] |200 **** c1 http[ 2] |OK **** c1 http[ 3] |Content-Length: 0 **** c1 http[ 4] |Date: Mon, 07 Aug 2023 15:35:03 GMT **** c1 http[ 5] |X-Varnish: 1008 **** c1 http[ 6] |Age: 0 **** c1 http[ 7] |Via: 1.1 v1 (Varnish/7.2) **** c1 http[ 8] |count: 0 **** c1 http[ 9] |Connection: keep-alive **** c1 bodylen = 0 ** c1 === expect resp.http.count == 0 **** c1 EXPECT resp.http.count (0) == "0" match ** c1 === expect resp.status == 200 **** c1 EXPECT resp.status (200) == "200" match ** c1 === txreq -url "/sick-0" **** c1 txreq|GET /sick-0 HTTP/1.1\r **** c1 txreq|Host: 127.0.0.1\r **** c1 txreq|\r **** dT 28.888 ** c1 === rxresp **** dT 28.924 **** s1 rxhdr|GET /sick-0 HTTP/1.1\r **** s1 rxhdr|Host: 127.0.0.1\r **** s1 rxhdr|X-Forwarded-For: 127.0.0.1\r **** s1 rxhdr|Via: 1.1 v1 (Varnish/7.2)\r **** s1 rxhdr|X-Varnish: 1011\r **** s1 rxhdr|\r **** s1 rxhdrlen = 113 **** s1 http[ 0] |GET **** s1 http[ 1] |/sick-0 **** s1 http[ 2] |HTTP/1.1 **** s1 http[ 3] |Host: 127.0.0.1 **** s1 http[ 4] |X-Forwarded-For: 127.0.0.1 **** s1 http[ 5] |Via: 1.1 v1 (Varnish/7.2) **** s1 http[ 6] |X-Varnish: 1011 **** s1 bodylen = 0 ** s1 === expect req.url == "/sick-0" **** s1 EXPECT req.url (/sick-0) == "/sick-0" match ** s1 === txresp -hdr "Saint: yes" **** s1 txresp|HTTP/1.1 200 OK\r **** s1 txresp|Saint: yes\r **** s1 txresp|Content-Length: 0\r **** s1 txresp|\r **** dT 28.926 ** s1 === accept **** s1 Accepting **** dT 28.954 **** v1 vsl| 1000 Link c req 1010 rxreq **** v1 vsl| 1011 Begin b bereq 1010 pass **** v1 vsl| 1011 VCL_use b vcl1 **** v1 vsl| 1011 Timestamp b Start: 1691422503.319652 0.000000 0.000000 **** v1 vsl| 1011 BereqMethod b GET **** v1 vsl| 1011 BereqURL b /sick-0 **** v1 vsl| 1011 BereqProtocol b HTTP/1.1 **** v1 vsl| 1011 BereqHeader b Host: 127.0.0.1 **** v1 vsl| 1011 BereqHeader b X-Forwarded-For: 127.0.0.1 **** v1 vsl| 1011 BereqHeader b Via: 1.1 v1 (Varnish/7.2) **** v1 vsl| 1011 BereqHeader b X-Varnish: 1011 **** v1 vsl| 1011 VCL_call b BACKEND_FETCH **** v1 vsl| 1011 VCL_return b fetch **** v1 vsl| 1011 Timestamp b Fetch: 1691422503.319944 0.000292 0.000292 **** v1 vsl| 1011 Timestamp b Connected: 1691422503.319998 0.000346 0.000053 **** v1 vsl| 1011 BackendOpen b 25 s1 127.0.0.1 38231 127.0.0.1 59954 reuse **** v1 vsl| 1011 Timestamp b Bereq: 1691422503.321219 0.001566 0.001220 **** v1 vsl| 1011 Timestamp b Beresp: 1691422503.357059 0.037407 0.035840 **** v1 vsl| 1011 BerespProtocol b HTTP/1.1 **** v1 vsl| 1011 BerespStatus b 200 **** v1 vsl| 1011 BerespReason b OK **** v1 vsl| 1011 BerespHeader b Saint: yes **** dT 28.955 **** v1 vsl| 1011 BerespHeader b Content-Length: 0 **** v1 vsl| 1011 BerespHeader b Date: Mon, 07 Aug 2023 15:35:03 GMT **** v1 vsl| 1011 VCL_call b BACKEND_RESPONSE **** v1 vsl| 1011 VCL_Log b saintmode: object put on blacklist for backend s1 for 0.50 seconds **** v1 vsl| 1011 VCL_return b retry **** v1 vsl| 1011 BackendClose b 25 s1 recycle **** v1 vsl| 1011 Timestamp b Retry: 1691422503.368959 0.049307 0.011899 **** v1 vsl| 1011 Link b bereq 1012 retry **** v1 vsl| 1011 End b **** v1 vsl| 1012 Begin b bereq 1011 retry **** v1 vsl| 1012 Timestamp b Start: 1691422503.368959 0.049307 0.000000 **** v1 vsl| 1012 BereqMethod b GET **** v1 vsl| 1012 BereqURL b /sick-0 **** v1 vsl| 1012 BereqProtocol b HTTP/1.1 **** v1 vsl| 1012 BereqHeader b Host: 127.0.0.1 **** v1 vsl| 1012 BereqHeader b X-Forwarded-For: 127.0.0.1 **** v1 vsl| 1012 BereqHeader b Via: 1.1 v1 (Varnish/7.2) **** v1 vsl| 1012 BereqHeader b X-Varnish: 1011 **** v1 vsl| 1012 BereqUnset b X-Varnish: 1011 **** v1 vsl| 1012 BereqHeader b X-Varnish: 1012 **** v1 vsl| 1012 VCL_call b BACKEND_FETCH **** v1 vsl| 1012 VCL_return b fetch **** v1 vsl| 1012 Timestamp b Fetch: 1691422503.369320 0.049668 0.000360 **** v1 vsl| 1012 VCL_Log b saintmode: unhealthy: object blacklisted for backend s1 **** v1 vsl| 1012 FetchError b Director sm returned no backend **** v1 vsl| 1012 Timestamp b Beresp: 1691422503.369384 0.049731 0.000063 **** v1 vsl| 1012 Timestamp b Error: 1691422503.369403 0.049750 0.000018 **** v1 vsl| 1012 BerespProtocol b HTTP/1.1 **** v1 vsl| 1012 BerespStatus b 503 **** v1 vsl| 1012 BerespReason b Backend fetch failed **** v1 vsl| 1012 BerespHeader b Date: Mon, 07 Aug 2023 15:35:03 GMT **** v1 vsl| 1012 BerespHeader b Server: Varnish **** v1 vsl| 1012 VCL_call b BACKEND_ERROR **** v1 vsl| 1012 BerespHeader b Content-Type: text/html; charset=utf-8 **** v1 vsl| 1012 BerespHeader b Retry-After: 5 **** v1 vsl| 1012 VCL_return b deliver **** v1 vsl| 1012 Storage b malloc Transient **** v1 vsl| 1012 Length b 281 **** v1 vsl| 1012 BereqAcct b 113 0 113 50 0 50 **** v1 vsl| 1012 End b **** v1 vsl| 1010 Begin c req 1000 rxreq **** v1 vsl| 1010 Timestamp c Start: 1691422503.318721 0.000000 0.000000 **** v1 vsl| 1010 Timestamp c Req: 1691422503.318721 0.000000 0.000000 **** v1 vsl| 1010 VCL_use c vcl1 **** v1 vsl| 1010 ReqStart c 127.0.0.1 34664 a0 **** v1 vsl| 1010 ReqMethod c GET **** v1 vsl| 1010 ReqURL c /sick-0 **** v1 vsl| 1010 ReqProtocol c HTTP/1.1 **** v1 vsl| 1010 ReqHeader c Host: 127.0.0.1 **** v1 vsl| 1010 ReqHeader c X-Forwarded-For: 127.0.0.1 **** v1 vsl| 1010 ReqHeader c Via: 1.1 v1 (Varnish/7.2) **** v1 vsl| 1010 VCL_call c RECV **** v1 vsl| 1010 VCL_return c pass **** v1 vsl| 1010 VCL_call c HASH **** v1 vsl| 1010 VCL_return c lookup **** v1 vsl| 1010 VCL_call c PASS **** v1 vsl| 1010 VCL_return c fetch **** v1 vsl| 1010 Link c bereq 1011 pass **** v1 vsl| 1010 Timestamp c Fetch: 1691422503.370725 0.052003 0.052003 **** dT 28.956 **** v1 vsl| 1010 RespProtocol c HTTP/1.1 **** v1 vsl| 1010 RespStatus c 503 **** v1 vsl| 1010 RespReason c Backend fetch failed **** v1 vsl| 1010 RespHeader c Date: Mon, 07 Aug 2023 15:35:03 GMT **** v1 vsl| 1010 RespHeader c Server: Varnish **** v1 vsl| 1010 RespHeader c Content-Type: text/html; charset=utf-8 **** v1 vsl| 1010 RespHeader c Retry-After: 5 **** v1 vsl| 1010 RespHeader c X-Varnish: 1010 **** v1 vsl| 1010 RespHeader c Age: 0 **** v1 vsl| 1010 RespHeader c Via: 1.1 v1 (Varnish/7.2) **** v1 vsl| 1010 VCL_call c DELIVER **** v1 vsl| 1010 RespHeader c count: 1 **** v1 vsl| 1010 VCL_return c deliver **** v1 vsl| 1010 Timestamp c Process: 1691422503.371039 0.052318 0.000314 **** v1 vsl| 1010 Filters c **** v1 vsl| 1010 RespHeader c Content-Length: 281 **** v1 vsl| 1010 RespHeader c Connection: keep-alive **** v1 vsl| 1010 Timestamp c Resp: 1691422503.372393 0.053671 0.001353 **** v1 vsl| 1010 ReqAcct c 41 0 41 254 281 535 **** v1 vsl| 1010 End c **** dT 29.023 **** c1 rxhdr|HTTP/1.1 503 Backend fetch failed\r **** c1 rxhdr|Date: Mon, 07 Aug 2023 15:35:03 GMT\r **** c1 rxhdr|Server: Varnish\r **** c1 rxhdr|Content-Type: text/html; charset=utf-8\r **** c1 rxhdr|Retry-After: 5\r **** c1 rxhdr|X-Varnish: 1010\r **** c1 rxhdr|Age: 0\r **** c1 rxhdr|Via: 1.1 v1 (Varnish/7.2)\r **** c1 rxhdr|count: 1\r **** c1 rxhdr|Content-Length: 281\r **** c1 rxhdr|Connection: keep-alive\r **** c1 rxhdr|\r **** c1 rxhdrlen = 254 **** c1 http[ 0] |HTTP/1.1 **** c1 http[ 1] |503 **** c1 http[ 2] |Backend fetch failed **** c1 http[ 3] |Date: Mon, 07 Aug 2023 15:35:03 GMT **** c1 http[ 4] |Server: Varnish **** c1 http[ 5] |Content-Type: text/html; charset=utf-8 **** c1 http[ 6] |Retry-After: 5 **** c1 http[ 7] |X-Varnish: 1010 **** c1 http[ 8] |Age: 0 **** c1 http[ 9] |Via: 1.1 v1 (Varnish/7.2) **** c1 http[10] |count: 1 **** c1 http[11] |Content-Length: 281 **** c1 http[12] |Connection: keep-alive **** dT 29.024 **** c1 c-l| **** c1 c-l| **** c1 c-l| **** c1 c-l| 503 Backend fetch failed **** c1 c-l| **** c1 c-l| **** c1 c-l|

Error 503 Backend fetch failed

**** c1 c-l|

Backend fetch failed

**** c1 c-l|

Guru Meditation:

**** c1 c-l|

XID: 1012

**** c1 c-l|
**** c1 c-l|

Varnish cache server

**** c1 c-l| **** c1 c-l| **** c1 bodylen = 281 ** c1 === expect resp.http.count == 1 **** c1 EXPECT resp.http.count (1) == "1" match ** c1 === expect resp.status == 503 **** c1 EXPECT resp.status (503) == "503" match ** c1 === txreq -url "/sick-1" **** c1 txreq|GET /sick-1 HTTP/1.1\r **** c1 txreq|Host: 127.0.0.1\r **** c1 txreq|\r **** dT 29.025 ** c1 === rxresp **** dT 29.030 *** s1 Accepted socket fd is 4 ** s1 === rxreq **** dT 29.053 **** s1 rxhdr|GET /sick-1 HTTP/1.1\r **** s1 rxhdr|Host: 127.0.0.1\r **** s1 rxhdr|X-Forwarded-For: 127.0.0.1\r **** s1 rxhdr|Via: 1.1 v1 (Varnish/7.2)\r **** s1 rxhdr|X-Varnish: 1014\r **** s1 rxhdr|\r **** s1 rxhdrlen = 113 **** s1 http[ 0] |GET **** s1 http[ 1] |/sick-1 **** s1 http[ 2] |HTTP/1.1 **** s1 http[ 3] |Host: 127.0.0.1 **** s1 http[ 4] |X-Forwarded-For: 127.0.0.1 **** s1 http[ 5] |Via: 1.1 v1 (Varnish/7.2) **** s1 http[ 6] |X-Varnish: 1014 **** s1 bodylen = 0 ** s1 === expect req.url == "/sick-1" **** s1 EXPECT req.url (/sick-1) == "/sick-1" match ** s1 === txresp -hdr "Saint: yes" **** s1 txresp|HTTP/1.1 200 OK\r **** s1 txresp|Saint: yes\r **** s1 txresp|Content-Length: 0\r **** s1 txresp|\r **** dT 29.054 ** s1 === accept **** s1 Accepting **** dT 29.057 **** v1 vsl| 1000 Link c req 1013 rxreq **** dT 29.362 **** v1 vsl| 1014 Begin b bereq 1013 pass **** dT 29.366 **** v1 vsl| 1014 VCL_use b vcl1 **** v1 vsl| 1014 Timestamp b Start: 1691422503.457552 0.000000 0.000000 **** dT 29.367 **** v1 vsl| 1014 BereqMethod b GET **** v1 vsl| 1014 BereqURL b /sick-1 **** v1 vsl| 1014 BereqProtocol b HTTP/1.1 **** v1 vsl| 1014 BereqHeader b Host: 127.0.0.1 **** v1 vsl| 1014 BereqHeader b X-Forwarded-For: 127.0.0.1 **** v1 vsl| 1014 BereqHeader b Via: 1.1 v1 (Varnish/7.2) **** v1 vsl| 1014 BereqHeader b X-Varnish: 1014 **** v1 vsl| 1014 VCL_call b BACKEND_FETCH **** v1 vsl| 1014 VCL_return b fetch **** v1 vsl| 1014 Timestamp b Fetch: 1691422503.458197 0.000644 0.000644 **** v1 vsl| 1014 Timestamp b Connected: 1691422503.460104 0.002552 0.001907 **** v1 vsl| 1014 BackendOpen b 25 s1 127.0.0.1 38231 127.0.0.1 59956 connect **** v1 vsl| 1014 Timestamp b Bereq: 1691422503.461424 0.003871 0.001319 **** v1 vsl| 1014 Timestamp b Beresp: 1691422503.484934 0.027381 0.023510 **** v1 vsl| 1014 BerespProtocol b HTTP/1.1 **** v1 vsl| 1014 BerespStatus b 200 **** v1 vsl| 1014 BerespReason b OK **** v1 vsl| 1014 BerespHeader b Saint: yes **** v1 vsl| 1014 BerespHeader b Content-Length: 0 **** v1 vsl| 1014 BerespHeader b Date: Mon, 07 Aug 2023 15:35:03 GMT **** v1 vsl| 1014 VCL_call b BACKEND_RESPONSE **** v1 vsl| 1014 VCL_Log b saintmode: object put on blacklist for backend s1 for 0.50 seconds **** v1 vsl| 1014 VCL_return b retry **** v1 vsl| 1014 BackendClose b 25 s1 recycle **** v1 vsl| 1014 Timestamp b Retry: 1691422503.496323 0.038771 0.011389 **** v1 vsl| 1014 Link b bereq 1015 retry **** v1 vsl| 1014 End b **** v1 vsl| 1015 Begin b bereq 1014 retry **** v1 vsl| 1015 Timestamp b Start: 1691422503.496323 0.038771 0.000000 **** v1 vsl| 1015 BereqMethod b GET **** v1 vsl| 1015 BereqURL b /sick-1 **** v1 vsl| 1015 BereqProtocol b HTTP/1.1 **** v1 vsl| 1015 BereqHeader b Host: 127.0.0.1 **** dT 29.369 **** v1 vsl| 1015 BereqHeader b X-Forwarded-For: 127.0.0.1 **** v1 vsl| 1015 BereqHeader b Via: 1.1 v1 (Varnish/7.2) **** v1 vsl| 1015 BereqHeader b X-Varnish: 1014 **** v1 vsl| 1015 BereqUnset b X-Varnish: 1014 **** v1 vsl| 1015 BereqHeader b X-Varnish: 1015 **** v1 vsl| 1015 VCL_call b BACKEND_FETCH **** v1 vsl| 1015 VCL_return b fetch **** v1 vsl| 1015 Timestamp b Fetch: 1691422503.496618 0.039065 0.000294 **** v1 vsl| 1015 VCL_Log b saintmode: unhealthy: object blacklisted for backend s1 **** dT 29.370 **** v1 vsl| 1015 FetchError b Director sm returned no backend **** v1 vsl| 1015 Timestamp b Beresp: 1691422503.496688 0.039135 0.000070 **** v1 vsl| 1015 Timestamp b Error: 1691422503.496705 0.039153 0.000017 **** v1 vsl| 1015 BerespProtocol b HTTP/1.1 **** v1 vsl| 1015 BerespStatus b 503 **** v1 vsl| 1015 BerespReason b Backend fetch failed **** v1 vsl| 1015 BerespHeader b Date: Mon, 07 Aug 2023 15:35:03 GMT **** v1 vsl| 1015 BerespHeader b Server: Varnish **** v1 vsl| 1015 VCL_call b BACKEND_ERROR **** v1 vsl| 1015 BerespHeader b Content-Type: text/html; charset=utf-8 **** v1 vsl| 1015 BerespHeader b Retry-After: 5 **** v1 vsl| 1015 VCL_return b deliver **** v1 vsl| 1015 Storage b malloc Transient **** v1 vsl| 1015 Length b 281 **** v1 vsl| 1015 BereqAcct b 113 0 113 50 0 50 **** v1 vsl| 1015 End b **** v1 vsl| 1013 Begin c req 1000 rxreq **** v1 vsl| 1013 Timestamp c Start: 1691422503.456678 0.000000 0.000000 **** v1 vsl| 1013 Timestamp c Req: 1691422503.456678 0.000000 0.000000 **** v1 vsl| 1013 VCL_use c vcl1 **** v1 vsl| 1013 ReqStart c 127.0.0.1 34664 a0 **** v1 vsl| 1013 ReqMethod c GET **** v1 vsl| 1013 ReqURL c /sick-1 **** v1 vsl| 1013 ReqProtocol c HTTP/1.1 **** v1 vsl| 1013 ReqHeader c Host: 127.0.0.1 **** v1 vsl| 1013 ReqHeader c X-Forwarded-For: 127.0.0.1 **** v1 vsl| 1013 ReqHeader c Via: 1.1 v1 (Varnish/7.2) **** v1 vsl| 1013 VCL_call c RECV **** v1 vsl| 1013 VCL_return c pass **** v1 vsl| 1013 VCL_call c HASH **** v1 vsl| 1013 VCL_return c lookup **** v1 vsl| 1013 VCL_call c PASS **** v1 vsl| 1013 VCL_return c fetch **** v1 vsl| 1013 Link c bereq 1014 pass **** v1 vsl| 1013 Timestamp c Fetch: 1691422503.497989 0.041310 0.041310 **** v1 vsl| 1013 RespProtocol c HTTP/1.1 **** v1 vsl| 1013 RespStatus c 503 **** v1 vsl| 1013 RespReason c Backend fetch failed **** v1 vsl| 1013 RespHeader c Date: Mon, 07 Aug 2023 15:35:03 GMT **** v1 vsl| 1013 RespHeader c Server: Varnish **** v1 vsl| 1013 RespHeader c Content-Type: text/html; charset=utf-8 **** v1 vsl| 1013 RespHeader c Retry-After: 5 **** v1 vsl| 1013 RespHeader c X-Varnish: 1013 **** v1 vsl| 1013 RespHeader c Age: 0 **** v1 vsl| 1013 RespHeader c Via: 1.1 v1 (Varnish/7.2) **** v1 vsl| 1013 VCL_call c DELIVER **** v1 vsl| 1013 RespHeader c count: 2 **** v1 vsl| 1013 VCL_return c deliver **** v1 vsl| 1013 Timestamp c Process: 1691422503.498296 0.041618 0.000307 **** v1 vsl| 1013 Filters c **** v1 vsl| 1013 RespHeader c Content-Length: 281 **** v1 vsl| 1013 RespHeader c Connection: keep-alive **** v1 vsl| 1013 Timestamp c Resp: 1691422503.499707 0.043028 0.001410 **** v1 vsl| 1013 ReqAcct c 41 0 41 254 281 535 **** v1 vsl| 1013 End c **** dT 29.411 **** c1 rxhdr|HTTP/1.1 503 Backend fetch failed\r **** c1 rxhdr|Date: Mon, 07 Aug 2023 15:35:03 GMT\r **** c1 rxhdr|Server: Varnish\r **** c1 rxhdr|Content-Type: text/html; charset=utf-8\r **** c1 rxhdr|Retry-After: 5\r **** c1 rxhdr|X-Varnish: 1013\r **** c1 rxhdr|Age: 0\r **** c1 rxhdr|Via: 1.1 v1 (Varnish/7.2)\r **** c1 rxhdr|count: 2\r **** c1 rxhdr|Content-Length: 281\r **** c1 rxhdr|Connection: keep-alive\r **** c1 rxhdr|\r **** c1 rxhdrlen = 254 **** dT 29.413 **** c1 http[ 0] |HTTP/1.1 **** c1 http[ 1] |503 **** c1 http[ 2] |Backend fetch failed **** c1 http[ 3] |Date: Mon, 07 Aug 2023 15:35:03 GMT **** c1 http[ 4] |Server: Varnish **** c1 http[ 5] |Content-Type: text/html; charset=utf-8 **** c1 http[ 6] |Retry-After: 5 **** c1 http[ 7] |X-Varnish: 1013 **** c1 http[ 8] |Age: 0 **** c1 http[ 9] |Via: 1.1 v1 (Varnish/7.2) **** c1 http[10] |count: 2 **** c1 http[11] |Content-Length: 281 **** c1 http[12] |Connection: keep-alive **** dT 29.420 **** c1 c-l| **** c1 c-l| **** c1 c-l| **** c1 c-l| 503 Backend fetch failed **** c1 c-l| **** c1 c-l| **** c1 c-l|

Error 503 Backend fetch failed

**** c1 c-l|

Backend fetch failed

**** c1 c-l|

Guru Meditation:

**** c1 c-l|

XID: 1015

**** c1 c-l|
**** c1 c-l|

Varnish cache server

**** c1 c-l| **** c1 c-l| **** c1 bodylen = 281 ** c1 === expect resp.http.count == 2 **** dT 29.422 **** c1 EXPECT resp.http.count (2) == "2" match ** c1 === expect resp.status == 503 **** c1 EXPECT resp.status (503) == "503" match ** c1 === txreq -url "/sick-2" **** dT 29.426 **** c1 txreq|GET /sick-2 HTTP/1.1\r **** c1 txreq|Host: 127.0.0.1\r **** c1 txreq|\r **** dT 29.459 ** c1 === rxresp **** dT 29.474 **** v1 vsl| 1000 Link c req 1016 rxreq **** dT 29.527 *** s1 Accepted socket fd is 4 ** s1 === rxreq **** dT 29.584 **** s1 rxhdr|GET /sick-2 HTTP/1.1\r **** s1 rxhdr|Host: 127.0.0.1\r **** s1 rxhdr|X-Forwarded-For: 127.0.0.1\r **** s1 rxhdr|Via: 1.1 v1 (Varnish/7.2)\r **** s1 rxhdr|X-Varnish: 1017\r **** s1 rxhdr|\r **** s1 rxhdrlen = 113 **** s1 http[ 0] |GET **** s1 http[ 1] |/sick-2 **** s1 http[ 2] |HTTP/1.1 **** s1 http[ 3] |Host: 127.0.0.1 **** s1 http[ 4] |X-Forwarded-For: 127.0.0.1 **** s1 http[ 5] |Via: 1.1 v1 (Varnish/7.2) **** s1 http[ 6] |X-Varnish: 1017 **** s1 bodylen = 0 ** s1 === expect req.url == "/sick-2" **** s1 EXPECT req.url (/sick-2) == "/sick-2" match ** s1 === txresp -hdr "Saint: yes" **** dT 29.585 **** s1 txresp|HTTP/1.1 200 OK\r **** s1 txresp|Saint: yes\r **** s1 txresp|Content-Length: 0\r **** s1 txresp|\r **** dT 29.594 *** s1 shutting fd 4 **** dT 29.599 ** s1 Ending **** dT 29.679 **** v1 vsl| 1017 Begin b bereq 1016 pass **** v1 vsl| 1017 VCL_use b vcl1 **** v1 vsl| 1017 Timestamp b Start: 1691422503.927077 0.000000 0.000000 **** v1 vsl| 1017 BereqMethod b GET **** v1 vsl| 1017 BereqURL b /sick-2 **** v1 vsl| 1017 BereqProtocol b HTTP/1.1 **** v1 vsl| 1017 BereqHeader b Host: 127.0.0.1 **** v1 vsl| 1017 BereqHeader b X-Forwarded-For: 127.0.0.1 **** v1 vsl| 1017 BereqHeader b Via: 1.1 v1 (Varnish/7.2) **** v1 vsl| 1017 BereqHeader b X-Varnish: 1017 **** v1 vsl| 1017 VCL_call b BACKEND_FETCH **** v1 vsl| 1017 VCL_return b fetch **** v1 vsl| 1017 Timestamp b Fetch: 1691422503.930129 0.003052 0.003052 **** v1 vsl| 1017 Timestamp b Connected: 1691422503.957507 0.030430 0.027377 **** v1 vsl| 1017 BackendOpen b 25 s1 127.0.0.1 38231 127.0.0.1 59968 connect **** dT 29.681 **** v1 vsl| 1017 Timestamp b Bereq: 1691422503.965330 0.038252 0.007822 **** v1 vsl| 1017 Timestamp b Beresp: 1691422504.028310 0.101233 0.062980 **** v1 vsl| 1017 BerespProtocol b HTTP/1.1 **** v1 vsl| 1017 BerespStatus b 200 **** v1 vsl| 1017 BerespReason b OK **** v1 vsl| 1017 BerespHeader b Saint: yes **** v1 vsl| 1017 BerespHeader b Content-Length: 0 **** v1 vsl| 1017 BerespHeader b Date: Mon, 07 Aug 2023 15:35:04 GMT **** v1 vsl| 1017 VCL_call b BACKEND_RESPONSE **** v1 vsl| 1017 VCL_Log b saintmode: object put on blacklist for backend s1 for 0.50 seconds **** v1 vsl| 1017 VCL_return b retry **** v1 vsl| 1017 BackendClose b 25 s1 recycle **** v1 vsl| 1017 Timestamp b Retry: 1691422504.048597 0.121520 0.020286 **** v1 vsl| 1017 Link b bereq 1018 retry **** v1 vsl| 1017 End b **** v1 vsl| 1018 Begin b bereq 1017 retry **** v1 vsl| 1018 Timestamp b Start: 1691422504.048597 0.121520 0.000000 **** v1 vsl| 1018 BereqMethod b GET **** v1 vsl| 1018 BereqURL b /sick-2 **** v1 vsl| 1018 BereqProtocol b HTTP/1.1 **** v1 vsl| 1018 BereqHeader b Host: 127.0.0.1 **** v1 vsl| 1018 BereqHeader b X-Forwarded-For: 127.0.0.1 **** v1 vsl| 1018 BereqHeader b Via: 1.1 v1 (Varnish/7.2) **** v1 vsl| 1018 BereqHeader b X-Varnish: 1017 **** v1 vsl| 1018 BereqUnset b X-Varnish: 1017 **** v1 vsl| 1018 BereqHeader b X-Varnish: 1018 **** v1 vsl| 1018 VCL_call b BACKEND_FETCH **** v1 vsl| 1018 VCL_return b fetch **** v1 vsl| 1018 Timestamp b Fetch: 1691422504.052506 0.125428 0.003908 **** v1 vsl| 1018 VCL_Log b saintmode: unhealthy: object blacklisted for backend s1 **** v1 vsl| 1018 FetchError b Director sm returned no backend **** v1 vsl| 1018 Timestamp b Beresp: 1691422504.052721 0.125644 0.000215 **** v1 vsl| 1018 Timestamp b Error: 1691422504.052865 0.125788 0.000144 **** v1 vsl| 1018 BerespProtocol b HTTP/1.1 **** v1 vsl| 1018 BerespStatus b 503 **** v1 vsl| 1018 BerespReason b Backend fetch failed **** v1 vsl| 1018 BerespHeader b Date: Mon, 07 Aug 2023 15:35:04 GMT **** dT 29.682 **** v1 vsl| 1018 BerespHeader b Server: Varnish **** v1 vsl| 1018 VCL_call b BACKEND_ERROR **** v1 vsl| 1018 BerespHeader b Content-Type: text/html; charset=utf-8 **** v1 vsl| 1018 BerespHeader b Retry-After: 5 **** v1 vsl| 1018 VCL_return b deliver **** v1 vsl| 1018 Storage b malloc Transient **** v1 vsl| 1018 Length b 281 **** v1 vsl| 1018 BereqAcct b 113 0 113 50 0 50 **** v1 vsl| 1018 End b **** v1 vsl| 1016 Begin c req 1000 rxreq **** v1 vsl| 1016 Timestamp c Start: 1691422503.888187 0.000000 0.000000 **** v1 vsl| 1016 Timestamp c Req: 1691422503.888187 0.000000 0.000000 **** v1 vsl| 1016 VCL_use c vcl1 **** v1 vsl| 1016 ReqStart c 127.0.0.1 34664 a0 **** v1 vsl| 1016 ReqMethod c GET **** v1 vsl| 1016 ReqURL c /sick-2 **** v1 vsl| 1016 ReqProtocol c HTTP/1.1 **** v1 vsl| 1016 ReqHeader c Host: 127.0.0.1 **** v1 vsl| 1016 ReqHeader c X-Forwarded-For: 127.0.0.1 **** v1 vsl| 1016 ReqHeader c Via: 1.1 v1 (Varnish/7.2) **** v1 vsl| 1016 VCL_call c RECV **** v1 vsl| 1016 VCL_return c pass **** v1 vsl| 1016 VCL_call c HASH **** v1 vsl| 1016 VCL_return c lookup **** v1 vsl| 1016 VCL_call c PASS **** v1 vsl| 1016 VCL_return c fetch **** v1 vsl| 1016 Link c bereq 1017 pass **** v1 vsl| 1016 Timestamp c Fetch: 1691422504.059890 0.171703 0.171703 **** v1 vsl| 1016 RespProtocol c HTTP/1.1 **** v1 vsl| 1016 RespStatus c 503 **** v1 vsl| 1016 RespReason c Backend fetch failed **** v1 vsl| 1016 RespHeader c Date: Mon, 07 Aug 2023 15:35:04 GMT **** v1 vsl| 1016 RespHeader c Server: Varnish **** v1 vsl| 1016 RespHeader c Content-Type: text/html; charset=utf-8 **** v1 vsl| 1016 RespHeader c Retry-After: 5 **** v1 vsl| 1016 RespHeader c X-Varnish: 1016 **** v1 vsl| 1016 RespHeader c Age: 0 **** v1 vsl| 1016 RespHeader c Via: 1.1 v1 (Varnish/7.2) **** v1 vsl| 1016 VCL_call c DELIVER **** v1 vsl| 1016 RespHeader c count: 2 **** v1 vsl| 1016 VCL_return c deliver **** v1 vsl| 1016 Timestamp c Process: 1691422504.061741 0.173554 0.001850 **** v1 vsl| 1016 Filters c **** v1 vsl| 1016 RespHeader c Content-Length: 281 **** v1 vsl| 1016 RespHeader c Connection: keep-alive **** v1 vsl| 1016 Timestamp c Resp: 1691422504.065704 0.177517 0.003963 **** v1 vsl| 1016 ReqAcct c 41 0 41 254 281 535 **** v1 vsl| 1016 End c **** dT 29.688 **** c1 rxhdr|HTTP/1.1 503 Backend fetch failed\r **** c1 rxhdr|Date: Mon, 07 Aug 2023 15:35:04 GMT\r **** c1 rxhdr|Server: Varnish\r **** c1 rxhdr|Content-Type: text/html; charset=utf-8\r **** c1 rxhdr|Retry-After: 5\r **** c1 rxhdr|X-Varnish: 1016\r **** c1 rxhdr|Age: 0\r **** c1 rxhdr|Via: 1.1 v1 (Varnish/7.2)\r **** c1 rxhdr|count: 2\r **** c1 rxhdr|Content-Length: 281\r **** c1 rxhdr|Connection: keep-alive\r **** c1 rxhdr|\r **** c1 rxhdrlen = 254 **** c1 http[ 0] |HTTP/1.1 **** c1 http[ 1] |503 **** c1 http[ 2] |Backend fetch failed **** c1 http[ 3] |Date: Mon, 07 Aug 2023 15:35:04 GMT **** c1 http[ 4] |Server: Varnish **** c1 http[ 5] |Content-Type: text/html; charset=utf-8 **** c1 http[ 6] |Retry-After: 5 **** dT 29.689 **** c1 http[ 7] |X-Varnish: 1016 **** c1 http[ 8] |Age: 0 **** c1 http[ 9] |Via: 1.1 v1 (Varnish/7.2) **** c1 http[10] |count: 2 **** c1 http[11] |Content-Length: 281 **** c1 http[12] |Connection: keep-alive **** c1 c-l| **** c1 c-l| **** c1 c-l| **** c1 c-l| 503 Backend fetch failed **** c1 c-l| **** c1 c-l| **** c1 c-l|

Error 503 Backend fetch failed

**** c1 c-l|

Backend fetch failed

**** c1 c-l|

Guru Meditation:

**** c1 c-l|

XID: 1018

**** c1 c-l|
**** c1 c-l|

Varnish cache server

**** c1 c-l| **** c1 c-l| **** c1 bodylen = 281 ** c1 === expect resp.http.count == 3 **** dT 29.690 ---- c1 EXPECT resp.http.count (2) == "3" failed **** dT 29.709 * top RESETTING after ./tests/saintmode/test01.vtc **** dT 29.710 ** s1 Waiting for server (3/-1) **** dT 29.711 ** v1 Wait **** dT 29.712 **** v1 CLI TX|panic.show **** dT 29.766 *** v1 CLI RX 300 **** v1 CLI RX|Child has not panicked or panic has been cleared **** dT 29.772 *** v1 debug|Info: manager stopping child **** dT 29.773 *** v1 debug|Debug: Stopping Child **** dT 29.788 **** v1 vsl| 0 CLI - EOF on CLI connection, worker stops **** dT 29.975 *** v1 debug|Info: Child (1163618) ended **** dT 29.984 *** v1 debug|Info: Child (1163618) said Child dies **** dT 29.985 *** v1 debug|Debug: Child cleanup complete **** dT 29.986 *** v1 debug|Info: manager dies **** dT 30.008 **** v1 STDOUT EOF **** dT 30.015 ** v1 WAIT4 pid=1163181 status=0x0000 (user 20.051527 sys 5.065694) **** dT 30.017 * top TEST ./tests/saintmode/test01.vtc FAILED # top TEST ./tests/saintmode/test01.vtc FAILED (30.046) exit=2 FAIL tests/saintmode/test01.vtc (exit status: 2) FAIL: tests/xkey/test11 ======================= **** dT 0.008 * top TEST ./tests/xkey/test11.vtc starting **** dT 0.011 **** top extmacro def pkg_version=7.2.1 **** top extmacro def pkg_branch=7.2 **** top extmacro def pwd=/builddir/build/BUILD/varnish-modules-0.21.0/src **** top extmacro def date(...) **** top extmacro def string(...) **** top extmacro def vmod_builddir=/builddir/build/BUILD/varnish-modules-0.21.0/src **** top extmacro def vmod_directors=directors from "/usr/lib64/varnish/vmods/libvmod_directors.so" **** top extmacro def localhost=127.0.0.1 **** dT 0.012 **** top extmacro def bad_backend=127.0.0.1:37189 **** top extmacro def listen_addr=127.0.0.1:0 **** top extmacro def bad_ip=192.0.2.255 **** dT 0.015 **** top macro def testdir=/builddir/build/BUILD/varnish-modules-0.21.0/src/./tests/xkey **** dT 0.016 **** top macro def tmpdir=/tmp/vtc.1165863.02f1d7d2 **** dT 0.026 ** top === varnishtest "Test xkey counter initialization and cleanup" * top VTEST Test xkey counter initialization and cleanup **** dT 0.027 ** top === server s1 { **** dT 0.030 ** s1 Starting server **** dT 0.035 **** s1 macro def s1_addr=127.0.0.1 **** s1 macro def s1_port=43809 **** s1 macro def s1_sock=127.0.0.1:43809 * s1 Listen on 127.0.0.1:43809 **** dT 0.040 ** top === varnish v1 -vcl+backend { **** dT 0.044 ** s1 Started on 127.0.0.1:43809 (1 iterations) **** dT 0.432 ** v1 Launch *** v1 CMD: cd ${pwd} && exec varnishd -d -n /tmp/vtc.1165863.02f1d7d2/v1 -i v1 -l 2m -p auto_restart=off -p syslog_cli_traffic=off -p thread_pool_min=10 -p debug=+vtc_mode -p vsl_mask=+Debug -p h2_initial_window_size=1m -p h2_rx_window_low_water=64k -a '127.0.0.1:0' -M '127.0.0.1 43373' -P /tmp/vtc.1165863.02f1d7d2/v1/varnishd.pid **** dT 0.433 *** v1 CMD: cd /builddir/build/BUILD/varnish-modules-0.21.0/src && exec varnishd -d -n /tmp/vtc.1165863.02f1d7d2/v1 -i v1 -l 2m -p auto_restart=off -p syslog_cli_traffic=off -p thread_pool_min=10 -p debug=+vtc_mode -p vsl_mask=+Debug -p h2_initial_window_size=1m -p h2_rx_window_low_water=64k -a '127.0.0.1:0' -M '127.0.0.1 43373' -P /tmp/vtc.1165863.02f1d7d2/v1/varnishd.pid **** dT 0.517 *** v1 PID: 1165891 **** dT 0.519 **** v1 macro def v1_pid=1165891 **** v1 macro def v1_name=/tmp/vtc.1165863.02f1d7d2/v1 **** dT 1.678 *** v1 debug|Debug: Version: varnish-7.2.1 revision 399fa7ed46d68f4c4f42a8fd2748339750d99a8b **** dT 1.680 *** v1 debug|Debug: Platform: Linux,6.2.15-300.0.riscv64.fc38.riscv64,riscv64,-jnone,-sdefault,-sdefault,-hcritbit **** dT 1.681 *** v1 debug|200 335 *** v1 debug|----------------------------- *** v1 debug|Varnish Cache CLI 1.0 *** v1 debug|----------------------------- *** v1 debug|Linux,6.2.15-300.0.riscv64.fc38.riscv64,riscv64,-jnone,-sdefault,-sdefault,-hcritbit *** v1 debug|varnish-7.2.1 revision 399fa7ed46d68f4c4f42a8fd2748339750d99a8b *** v1 debug| *** v1 debug|Type 'help' for command list. *** v1 debug|Type 'quit' to close CLI session. *** v1 debug|Type 'start' to launch worker process. *** v1 debug| **** dT 1.693 **** v1 CLIPOLL 1 0x1 0x0 0x0 **** dT 1.694 *** v1 CLI connection fd = 6 **** dT 1.714 *** v1 CLI RX 107 **** v1 CLI RX|mjhbxfqscnuhvonkkwpqhintgqbtpziz **** v1 CLI RX| **** v1 CLI RX|Authentication required. **** dT 1.736 **** v1 CLI TX|auth 2356fea60c2c27848d3943d3fb204c8b690a76b985874c6b45ce72bc24e029f3 **** dT 1.760 *** v1 CLI RX 200 **** v1 CLI RX|----------------------------- **** v1 CLI RX|Varnish Cache CLI 1.0 **** v1 CLI RX|----------------------------- **** v1 CLI RX|Linux,6.2.15-300.0.riscv64.fc38.riscv64,riscv64,-jnone,-sdefault,-sdefault,-hcritbit **** v1 CLI RX|varnish-7.2.1 revision 399fa7ed46d68f4c4f42a8fd2748339750d99a8b **** v1 CLI RX| **** v1 CLI RX|Type 'help' for command list. **** v1 CLI RX|Type 'quit' to close CLI session. **** v1 CLI RX|Type 'start' to launch worker process. **** dT 1.773 **** v1 CLI TX|vcl.inline vcl1 << %XJEIFLH|)Xspa8P **** v1 CLI TX|vcl 4.1; **** v1 CLI TX|backend s1 { .host = "127.0.0.1"; .port = "43809"; } **** v1 CLI TX| **** v1 CLI TX| **** v1 CLI TX|\timport xkey from "/builddir/build/BUILD/varnish-modules-0.21.0/src/.libs/libvmod_xkey.so"; **** v1 CLI TX| **** v1 CLI TX|\tsub vcl_recv { **** v1 CLI TX|\t\tif (req.http.xkey-purge) { **** v1 CLI TX|\t\t\tif (xkey.purge(req.http.xkey-purge) != 0) { **** v1 CLI TX|\t\t\t\treturn (synth(200, "Purged")); **** v1 CLI TX|\t\t\t} else { **** v1 CLI TX|\t\t\t\treturn (synth(404, "No key")); **** v1 CLI TX|\t\t\t} **** v1 CLI TX|\t\t} **** v1 CLI TX|\t} **** v1 CLI TX| **** v1 CLI TX|\tsub vcl_backend_response { **** v1 CLI TX|\t\tset beresp.ttl = 60s; **** v1 CLI TX|\t\tset beresp.grace = 0s; **** v1 CLI TX|\t\tset beresp.keep = 0s; **** v1 CLI TX|\t} **** v1 CLI TX| **** v1 CLI TX|\tsub vcl_synth { **** v1 CLI TX|\t\tset resp.http.reason = resp.reason; **** v1 CLI TX|\t} **** v1 CLI TX| **** v1 CLI TX|%XJEIFLH|)Xspa8P **** dT 1.876 *** v1 vsl|No VSL chunk found (child not started ?) **** dT 1.977 *** v1 vsl|No VSL chunk found (child not started ?) **** dT 2.080 *** v1 vsl|No VSL chunk found (child not started ?) **** dT 2.181 *** v1 vsl|No VSL chunk found (child not started ?) **** dT 2.283 *** v1 vsl|No VSL chunk found (child not started ?) **** dT 2.384 *** v1 vsl|No VSL chunk found (child not started ?) **** dT 2.486 *** v1 vsl|No VSL chunk found (child not started ?) **** dT 2.588 *** v1 vsl|No VSL chunk found (child not started ?) **** dT 2.692 *** v1 vsl|No VSL chunk found (child not started ?) **** dT 2.794 *** v1 vsl|No VSL chunk found (child not started ?) **** dT 2.896 *** v1 vsl|No VSL chunk found (child not started ?) **** dT 2.997 *** v1 vsl|No VSL chunk found (child not started ?) **** dT 3.099 *** v1 vsl|No VSL chunk found (child not started ?) **** dT 3.200 *** v1 vsl|No VSL chunk found (child not started ?) **** dT 3.304 *** v1 vsl|No VSL chunk found (child not started ?) **** dT 3.406 *** v1 vsl|No VSL chunk found (child not started ?) **** dT 3.507 *** v1 vsl|No VSL chunk found (child not started ?) **** dT 3.610 *** v1 vsl|No VSL chunk found (child not started ?) **** dT 3.712 *** v1 vsl|No VSL chunk found (child not started ?) **** dT 3.814 *** v1 vsl|No VSL chunk found (child not started ?) **** dT 3.915 *** v1 vsl|No VSL chunk found (child not started ?) **** dT 4.017 *** v1 vsl|No VSL chunk found (child not started ?) **** dT 4.118 *** v1 vsl|No VSL chunk found (child not started ?) **** dT 4.220 *** v1 vsl|No VSL chunk found (child not started ?) **** dT 4.321 *** v1 vsl|No VSL chunk found (child not started ?) **** dT 4.423 *** v1 vsl|No VSL chunk found (child not started ?) **** dT 4.525 *** v1 vsl|No VSL chunk found (child not started ?) **** dT 4.626 *** v1 vsl|No VSL chunk found (child not started ?) **** dT 4.728 *** v1 vsl|No VSL chunk found (child not started ?) **** dT 4.830 *** v1 vsl|No VSL chunk found (child not started ?) **** dT 4.932 *** v1 vsl|No VSL chunk found (child not started ?) **** dT 5.034 *** v1 vsl|No VSL chunk found (child not started ?) **** dT 5.136 *** v1 vsl|No VSL chunk found (child not started ?) **** dT 5.238 *** v1 vsl|No VSL chunk found (child not started ?) **** dT 5.340 *** v1 vsl|No VSL chunk found (child not started ?) **** dT 5.724 *** v1 vsl|No VSL chunk found (child not started ?) **** dT 5.829 *** v1 vsl|No VSL chunk found (child not started ?) **** dT 5.948 *** v1 vsl|No VSL chunk found (child not started ?) **** dT 6.051 *** v1 vsl|No VSL chunk found (child not started ?) **** dT 6.152 *** v1 vsl|No VSL chunk found (child not started ?) **** dT 6.254 *** v1 vsl|No VSL chunk found (child not started ?) **** dT 6.355 *** v1 vsl|No VSL chunk found (child not started ?) **** dT 6.459 *** v1 vsl|No VSL chunk found (child not started ?) **** dT 6.560 *** v1 vsl|No VSL chunk found (child not started ?) **** dT 6.662 *** v1 vsl|No VSL chunk found (child not started ?) **** dT 6.763 *** v1 vsl|No VSL chunk found (child not started ?) **** dT 6.890 *** v1 vsl|No VSL chunk found (child not started ?) **** dT 6.992 *** v1 vsl|No VSL chunk found (child not started ?) **** dT 7.094 *** v1 vsl|No VSL chunk found (child not started ?) **** dT 7.195 *** v1 vsl|No VSL chunk found (child not started ?) **** dT 7.297 *** v1 vsl|No VSL chunk found (child not started ?) **** dT 7.399 *** v1 vsl|No VSL chunk found (child not started ?) **** dT 7.500 *** v1 vsl|No VSL chunk found (child not started ?) **** dT 7.602 *** v1 vsl|No VSL chunk found (child not started ?) **** dT 7.705 *** v1 vsl|No VSL chunk found (child not started ?) **** dT 7.807 *** v1 vsl|No VSL chunk found (child not started ?) **** dT 7.911 *** v1 vsl|No VSL chunk found (child not started ?) **** dT 8.012 *** v1 vsl|No VSL chunk found (child not started ?) **** dT 8.114 *** v1 vsl|No VSL chunk found (child not started ?) **** dT 8.216 *** v1 vsl|No VSL chunk found (child not started ?) **** dT 8.317 *** v1 vsl|No VSL chunk found (child not started ?) **** dT 8.420 *** v1 vsl|No VSL chunk found (child not started ?) **** dT 8.523 *** v1 vsl|No VSL chunk found (child not started ?) **** dT 8.624 *** v1 vsl|No VSL chunk found (child not started ?) **** dT 8.727 *** v1 vsl|No VSL chunk found (child not started ?) **** dT 8.829 *** v1 vsl|No VSL chunk found (child not started ?) **** dT 8.931 *** v1 vsl|No VSL chunk found (child not started ?) **** dT 9.032 *** v1 vsl|No VSL chunk found (child not started ?) **** dT 9.134 *** v1 vsl|No VSL chunk found (child not started ?) **** dT 9.235 *** v1 vsl|No VSL chunk found (child not started ?) **** dT 9.337 *** v1 vsl|No VSL chunk found (child not started ?) **** dT 9.439 *** v1 vsl|No VSL chunk found (child not started ?) **** dT 9.542 *** v1 vsl|No VSL chunk found (child not started ?) **** dT 9.643 *** v1 vsl|No VSL chunk found (child not started ?) **** dT 9.745 *** v1 vsl|No VSL chunk found (child not started ?) **** dT 9.847 *** v1 vsl|No VSL chunk found (child not started ?) **** dT 9.950 *** v1 vsl|No VSL chunk found (child not started ?) **** dT 10.051 *** v1 vsl|No VSL chunk found (child not started ?) **** dT 10.153 *** v1 vsl|No VSL chunk found (child not started ?) **** dT 10.254 *** v1 vsl|No VSL chunk found (child not started ?) **** dT 10.356 *** v1 vsl|No VSL chunk found (child not started ?) **** dT 10.458 *** v1 vsl|No VSL chunk found (child not started ?) **** dT 10.560 *** v1 vsl|No VSL chunk found (child not started ?) **** dT 10.663 *** v1 vsl|No VSL chunk found (child not started ?) **** dT 10.765 *** v1 vsl|No VSL chunk found (child not started ?) **** dT 10.866 *** v1 vsl|No VSL chunk found (child not started ?) **** dT 10.968 *** v1 vsl|No VSL chunk found (child not started ?) **** dT 11.070 *** v1 vsl|No VSL chunk found (child not started ?) **** dT 11.171 *** v1 vsl|No VSL chunk found (child not started ?) **** dT 11.273 *** v1 vsl|No VSL chunk found (child not started ?) **** dT 11.374 *** v1 vsl|No VSL chunk found (child not started ?) **** dT 11.477 *** v1 vsl|No VSL chunk found (child not started ?) **** dT 11.580 *** v1 vsl|No VSL chunk found (child not started ?) **** dT 11.682 *** v1 vsl|No VSL chunk found (child not started ?) **** dT 11.784 *** v1 vsl|No VSL chunk found (child not started ?) **** dT 11.886 *** v1 vsl|No VSL chunk found (child not started ?) **** dT 11.987 *** v1 vsl|No VSL chunk found (child not started ?) **** dT 12.089 *** v1 vsl|No VSL chunk found (child not started ?) **** dT 12.191 *** v1 vsl|No VSL chunk found (child not started ?) **** dT 12.293 *** v1 vsl|No VSL chunk found (child not started ?) **** dT 12.395 *** v1 vsl|No VSL chunk found (child not started ?) **** dT 12.498 *** v1 vsl|No VSL chunk found (child not started ?) **** dT 12.601 *** v1 vsl|No VSL chunk found (child not started ?) **** dT 12.703 *** v1 vsl|No VSL chunk found (child not started ?) **** dT 12.804 *** v1 vsl|No VSL chunk found (child not started ?) **** dT 12.906 *** v1 vsl|No VSL chunk found (child not started ?) **** dT 13.008 *** v1 vsl|No VSL chunk found (child not started ?) **** dT 13.109 *** v1 vsl|No VSL chunk found (child not started ?) **** dT 13.211 *** v1 vsl|No VSL chunk found (child not started ?) **** dT 13.312 *** v1 vsl|No VSL chunk found (child not started ?) **** dT 13.414 *** v1 vsl|No VSL chunk found (child not started ?) **** dT 13.516 *** v1 vsl|No VSL chunk found (child not started ?) **** dT 13.618 *** v1 vsl|No VSL chunk found (child not started ?) **** dT 13.720 *** v1 vsl|No VSL chunk found (child not started ?) **** dT 13.822 *** v1 vsl|No VSL chunk found (child not started ?) **** dT 13.924 *** v1 vsl|No VSL chunk found (child not started ?) **** dT 14.025 *** v1 vsl|No VSL chunk found (child not started ?) **** dT 14.126 *** v1 vsl|No VSL chunk found (child not started ?) **** dT 14.228 *** v1 vsl|No VSL chunk found (child not started ?) **** dT 14.329 *** v1 vsl|No VSL chunk found (child not started ?) **** dT 14.431 *** v1 vsl|No VSL chunk found (child not started ?) **** dT 14.532 *** v1 vsl|No VSL chunk found (child not started ?) **** dT 14.634 *** v1 vsl|No VSL chunk found (child not started ?) **** dT 14.735 *** v1 vsl|No VSL chunk found (child not started ?) **** dT 14.837 *** v1 vsl|No VSL chunk found (child not started ?) **** dT 14.939 *** v1 vsl|No VSL chunk found (child not started ?) **** dT 15.041 *** v1 vsl|No VSL chunk found (child not started ?) **** dT 15.143 *** v1 vsl|No VSL chunk found (child not started ?) **** dT 15.244 *** v1 vsl|No VSL chunk found (child not started ?) **** dT 15.346 *** v1 vsl|No VSL chunk found (child not started ?) **** dT 15.447 *** v1 vsl|No VSL chunk found (child not started ?) **** dT 15.549 *** v1 vsl|No VSL chunk found (child not started ?) **** dT 15.651 *** v1 vsl|No VSL chunk found (child not started ?) **** dT 15.753 *** v1 vsl|No VSL chunk found (child not started ?) **** dT 15.854 *** v1 vsl|No VSL chunk found (child not started ?) **** dT 15.956 *** v1 vsl|No VSL chunk found (child not started ?) **** dT 16.057 *** v1 vsl|No VSL chunk found (child not started ?) **** dT 16.159 *** v1 vsl|No VSL chunk found (child not started ?) **** dT 16.261 *** v1 vsl|No VSL chunk found (child not started ?) **** dT 16.363 *** v1 vsl|No VSL chunk found (child not started ?) **** dT 16.465 *** v1 vsl|No VSL chunk found (child not started ?) **** dT 16.566 *** v1 vsl|No VSL chunk found (child not started ?) **** dT 16.667 *** v1 vsl|No VSL chunk found (child not started ?) **** dT 16.769 *** v1 vsl|No VSL chunk found (child not started ?) **** dT 16.871 *** v1 vsl|No VSL chunk found (child not started ?) **** dT 16.973 *** v1 vsl|No VSL chunk found (child not started ?) **** dT 17.074 *** v1 vsl|No VSL chunk found (child not started ?) **** dT 17.176 *** v1 vsl|No VSL chunk found (child not started ?) **** dT 17.277 *** v1 vsl|No VSL chunk found (child not started ?) **** dT 17.378 *** v1 vsl|No VSL chunk found (child not started ?) **** dT 17.480 *** v1 vsl|No VSL chunk found (child not started ?) **** dT 17.581 *** v1 vsl|No VSL chunk found (child not started ?) **** dT 17.682 *** v1 vsl|No VSL chunk found (child not started ?) **** dT 17.785 *** v1 vsl|No VSL chunk found (child not started ?) **** dT 17.886 *** v1 vsl|No VSL chunk found (child not started ?) **** dT 17.988 *** v1 vsl|No VSL chunk found (child not started ?) **** dT 18.091 *** v1 vsl|No VSL chunk found (child not started ?) **** dT 18.192 *** v1 vsl|No VSL chunk found (child not started ?) **** dT 18.294 *** v1 vsl|No VSL chunk found (child not started ?) **** dT 18.395 *** v1 vsl|No VSL chunk found (child not started ?) **** dT 18.497 *** v1 vsl|No VSL chunk found (child not started ?) **** dT 18.602 *** v1 vsl|No VSL chunk found (child not started ?) **** dT 18.703 *** v1 vsl|No VSL chunk found (child not started ?) **** dT 18.805 *** v1 vsl|No VSL chunk found (child not started ?) **** dT 18.906 *** v1 vsl|No VSL chunk found (child not started ?) **** dT 19.008 *** v1 vsl|No VSL chunk found (child not started ?) **** dT 19.110 *** v1 vsl|No VSL chunk found (child not started ?) **** dT 19.230 *** v1 vsl|No VSL chunk found (child not started ?) **** dT 19.331 *** v1 vsl|No VSL chunk found (child not started ?) **** dT 19.433 *** v1 vsl|No VSL chunk found (child not started ?) **** dT 19.535 *** v1 vsl|No VSL chunk found (child not started ?) **** dT 19.637 *** v1 vsl|No VSL chunk found (child not started ?) **** dT 19.738 *** v1 vsl|No VSL chunk found (child not started ?) **** dT 19.841 *** v1 vsl|No VSL chunk found (child not started ?) **** dT 19.943 *** v1 vsl|No VSL chunk found (child not started ?) **** dT 20.045 *** v1 vsl|No VSL chunk found (child not started ?) **** dT 20.146 *** v1 vsl|No VSL chunk found (child not started ?) **** dT 20.248 *** v1 vsl|No VSL chunk found (child not started ?) **** dT 20.352 *** v1 vsl|No VSL chunk found (child not started ?) **** dT 20.454 *** v1 vsl|No VSL chunk found (child not started ?) **** dT 20.556 *** v1 vsl|No VSL chunk found (child not started ?) **** dT 20.657 *** v1 vsl|No VSL chunk found (child not started ?) **** dT 20.759 *** v1 vsl|No VSL chunk found (child not started ?) **** dT 20.861 *** v1 vsl|No VSL chunk found (child not started ?) **** dT 20.962 *** v1 vsl|No VSL chunk found (child not started ?) **** dT 21.064 *** v1 vsl|No VSL chunk found (child not started ?) **** dT 21.165 *** v1 vsl|No VSL chunk found (child not started ?) **** dT 21.267 *** v1 vsl|No VSL chunk found (child not started ?) **** dT 21.368 *** v1 vsl|No VSL chunk found (child not started ?) **** dT 21.470 *** v1 vsl|No VSL chunk found (child not started ?) **** dT 21.571 *** v1 vsl|No VSL chunk found (child not started ?) **** dT 21.673 *** v1 vsl|No VSL chunk found (child not started ?) **** dT 21.774 *** v1 vsl|No VSL chunk found (child not started ?) **** dT 21.875 *** v1 vsl|No VSL chunk found (child not started ?) **** dT 21.977 *** v1 vsl|No VSL chunk found (child not started ?) **** dT 22.078 *** v1 vsl|No VSL chunk found (child not started ?) **** dT 22.180 *** v1 vsl|No VSL chunk found (child not started ?) **** dT 22.281 *** v1 vsl|No VSL chunk found (child not started ?) **** dT 22.383 *** v1 vsl|No VSL chunk found (child not started ?) **** dT 22.484 *** v1 vsl|No VSL chunk found (child not started ?) **** dT 22.586 *** v1 vsl|No VSL chunk found (child not started ?) **** dT 22.687 *** v1 vsl|No VSL chunk found (child not started ?) **** dT 22.789 *** v1 vsl|No VSL chunk found (child not started ?) **** dT 22.891 *** v1 vsl|No VSL chunk found (child not started ?) **** dT 22.992 *** v1 vsl|No VSL chunk found (child not started ?) **** dT 23.094 *** v1 vsl|No VSL chunk found (child not started ?) **** dT 23.196 *** v1 vsl|No VSL chunk found (child not started ?) **** dT 23.297 *** v1 vsl|No VSL chunk found (child not started ?) **** dT 23.400 *** v1 vsl|No VSL chunk found (child not started ?) **** dT 23.505 *** v1 vsl|No VSL chunk found (child not started ?) **** dT 23.606 *** v1 vsl|No VSL chunk found (child not started ?) **** dT 23.708 *** v1 vsl|No VSL chunk found (child not started ?) **** dT 23.811 *** v1 vsl|No VSL chunk found (child not started ?) **** dT 23.912 *** v1 vsl|No VSL chunk found (child not started ?) **** dT 24.013 *** v1 vsl|No VSL chunk found (child not started ?) **** dT 24.114 *** v1 vsl|No VSL chunk found (child not started ?) **** dT 24.216 *** v1 vsl|No VSL chunk found (child not started ?) **** dT 24.317 *** v1 vsl|No VSL chunk found (child not started ?) **** dT 24.419 *** v1 vsl|No VSL chunk found (child not started ?) **** dT 24.521 *** v1 vsl|No VSL chunk found (child not started ?) **** dT 24.622 *** v1 vsl|No VSL chunk found (child not started ?) **** dT 24.723 *** v1 vsl|No VSL chunk found (child not started ?) **** dT 24.825 *** v1 vsl|No VSL chunk found (child not started ?) **** dT 24.926 *** v1 vsl|No VSL chunk found (child not started ?) **** dT 25.027 *** v1 vsl|No VSL chunk found (child not started ?) **** dT 25.054 *** v1 CLI RX 200 **** dT 25.055 **** v1 CLI RX|VCL compiled. **** v1 CLI TX|vcl.use vcl1 **** dT 25.063 *** v1 CLI RX 200 **** v1 CLI RX|VCL 'vcl1' now active ** v1 Start **** v1 CLI TX|start **** dT 25.129 *** v1 vsl|No VSL chunk found (child not started ?) **** dT 25.231 *** v1 vsl|No VSL chunk found (child not started ?) **** dT 25.323 *** v1 debug|Debug: Child (1166037) Started **** dT 25.334 *** v1 vsl|No VSL chunk found (child not started ?) **** dT 25.570 *** v1 debug|Child launched OK **** dT 25.645 **** v1 vsl| 0 CLI - Rd vcl.load "vcl1" vcl_vcl1.1691422619.165342/vgc.so 1auto **** dT 25.681 *** v1 CLI RX 200 **** dT 25.682 *** v1 wait-running **** v1 CLI TX|status **** dT 25.683 *** v1 debug|Info: Child (1166037) said Child starts **** dT 25.686 *** v1 CLI RX 200 **** v1 CLI RX|Child in state running **** v1 CLI TX|debug.listen_address **** dT 25.736 *** v1 CLI RX 200 **** v1 CLI RX|a0 127.0.0.1 36479 **** v1 CLI TX|debug.xid 999 **** dT 25.751 **** v1 vsl| 0 CLI - Wr 200 52 Loaded "vcl_vcl1.1691422619.165342/vgc.so" as "vcl1" **** v1 vsl| 0 CLI - Rd vcl.use "vcl1" **** v1 vsl| 0 CLI - Wr 200 0 **** v1 vsl| 0 CLI - Rd start **** v1 vsl| 0 Debug - sockopt: Setting SO_LINGER for a0=127.0.0.1:36479 **** v1 vsl| 0 Debug - sockopt: Setting SO_KEEPALIVE for a0=127.0.0.1:36479 **** v1 vsl| 0 Debug - sockopt: Setting SO_SNDTIMEO for a0=127.0.0.1:36479 **** v1 vsl| 0 Debug - sockopt: Setting SO_RCVTIMEO for a0=127.0.0.1:36479 **** v1 vsl| 0 Debug - sockopt: Setting TCP_NODELAY for a0=127.0.0.1:36479 **** dT 25.752 **** v1 vsl| 0 Debug - sockopt: Setting TCP_KEEPIDLE for a0=127.0.0.1:36479 **** v1 vsl| 0 Debug - sockopt: Setting TCP_KEEPCNT for a0=127.0.0.1:36479 **** v1 vsl| 0 Debug - sockopt: Setting TCP_KEEPINTVL for a0=127.0.0.1:36479 **** v1 vsl| 0 CLI - Wr 200 0 **** v1 vsl| 0 CLI - Rd debug.listen_address **** v1 vsl| 0 CLI - Wr 200 19 a0 127.0.0.1 36479 **** dT 25.784 *** v1 CLI RX 200 **** v1 CLI RX|XID is 999 chunk 1 **** v1 CLI TX|debug.listen_address **** dT 25.833 *** v1 CLI RX 200 **** v1 CLI RX|a0 127.0.0.1 36479 **** dT 25.834 ** v1 Listen on 127.0.0.1 36479 **** dT 25.835 **** v1 macro def v1_addr=127.0.0.1 **** v1 macro def v1_port=36479 **** v1 macro def v1_sock=127.0.0.1:36479 **** v1 macro def v1_a0_addr=127.0.0.1 **** v1 macro def v1_a0_port=36479 **** v1 macro def v1_a0_sock=127.0.0.1:36479 ** top === client c1 { **** dT 25.838 ** c1 Starting client **** dT 25.843 ** c1 Waiting for client **** dT 25.846 ** c1 Started on 127.0.0.1:36479 (1 iterations) *** c1 Connect to 127.0.0.1:36479 **** dT 25.853 **** v1 vsl| 0 CLI - Rd debug.xid 999 **** v1 vsl| 0 CLI - Wr 200 18 XID is 999 chunk 1 **** v1 vsl| 0 CLI - Rd debug.listen_address **** v1 vsl| 0 CLI - Wr 200 19 a0 127.0.0.1 36479 **** dT 25.860 *** c1 connected fd 16 from 127.0.0.1 42538 to 127.0.0.1:36479 **** dT 25.861 ** c1 === txreq **** dT 25.862 **** c1 txreq|GET / HTTP/1.1\r **** c1 txreq|Host: 127.0.0.1\r **** c1 txreq|\r **** dT 25.863 ** c1 === rxresp **** dT 25.903 *** s1 accepted fd 4 127.0.0.1 49382 **** dT 25.904 ** s1 === rxreq **** dT 25.955 **** v1 vsl| 1000 Begin c sess 0 HTTP/1 **** v1 vsl| 1000 SessOpen c 127.0.0.1 42538 a0 127.0.0.1 36479 1691422643.251068 22 **** v1 vsl| 1000 Debug c sockopt: SO_LINGER may be inherited for a0=127.0.0.1:36479 **** v1 vsl| 1000 Debug c sockopt: SO_KEEPALIVE may be inherited for a0=127.0.0.1:36479 **** v1 vsl| 1000 Debug c sockopt: SO_SNDTIMEO may be inherited for a0=127.0.0.1:36479 **** v1 vsl| 1000 Debug c sockopt: SO_RCVTIMEO may be inherited for a0=127.0.0.1:36479 **** v1 vsl| 1000 Debug c sockopt: TCP_NODELAY may be inherited for a0=127.0.0.1:36479 **** v1 vsl| 1000 Debug c sockopt: TCP_KEEPIDLE may be inherited for a0=127.0.0.1:36479 **** v1 vsl| 1000 Debug c sockopt: TCP_KEEPCNT may be inherited for a0=127.0.0.1:36479 **** v1 vsl| 1000 Debug c sockopt: TCP_KEEPINTVL may be inherited for a0=127.0.0.1:36479 **** v1 vsl| 1000 Link c req 1001 rxreq **** dT 25.977 **** s1 rxhdr|GET / HTTP/1.1\r **** s1 rxhdr|Host: 127.0.0.1\r **** s1 rxhdr|X-Forwarded-For: 127.0.0.1\r **** s1 rxhdr|Via: 1.1 v1 (Varnish/7.2)\r **** s1 rxhdr|Accept-Encoding: gzip\r **** s1 rxhdr|X-Varnish: 1002\r **** s1 rxhdr|\r **** s1 rxhdrlen = 130 **** dT 25.978 **** s1 http[ 0] |GET **** s1 http[ 1] |/ **** s1 http[ 2] |HTTP/1.1 **** s1 http[ 3] |Host: 127.0.0.1 **** s1 http[ 4] |X-Forwarded-For: 127.0.0.1 **** s1 http[ 5] |Via: 1.1 v1 (Varnish/7.2) **** s1 http[ 6] |Accept-Encoding: gzip **** s1 http[ 7] |X-Varnish: 1002 **** dT 25.979 **** s1 bodylen = 0 ** s1 === txresp -hdr "xkey: asdf" **** dT 25.980 **** s1 txresp|HTTP/1.1 200 OK\r **** s1 txresp|xkey: asdf\r **** s1 txresp|Content-Length: 0\r **** s1 txresp|\r **** dT 25.983 *** s1 shutting fd 4 **** dT 25.984 ** s1 Ending **** dT 26.058 **** v1 vsl| 1002 Begin b bereq 1001 fetch **** v1 vsl| 1002 VCL_use b vcl1 **** v1 vsl| 1002 Timestamp b Start: 1691422643.282150 0.000000 0.000000 **** v1 vsl| 1002 BereqMethod b GET **** v1 vsl| 1002 BereqURL b / **** v1 vsl| 1002 BereqProtocol b HTTP/1.1 **** v1 vsl| 1002 BereqHeader b Host: 127.0.0.1 **** v1 vsl| 1002 BereqHeader b X-Forwarded-For: 127.0.0.1 **** v1 vsl| 1002 BereqHeader b Via: 1.1 v1 (Varnish/7.2) **** v1 vsl| 1002 BereqHeader b Accept-Encoding: gzip **** v1 vsl| 1002 BereqHeader b X-Varnish: 1002 **** v1 vsl| 1002 VCL_call b BACKEND_FETCH **** v1 vsl| 1002 VCL_return b fetch **** v1 vsl| 1002 Timestamp b Fetch: 1691422643.285057 0.002907 0.002907 **** v1 vsl| 1002 Timestamp b Connected: 1691422643.290538 0.008388 0.005481 **** v1 vsl| 1002 BackendOpen b 25 s1 127.0.0.1 43809 127.0.0.1 49382 connect **** v1 vsl| 1002 Timestamp b Bereq: 1691422643.294170 0.012020 0.003632 **** v1 vsl| 1002 Timestamp b Beresp: 1691422643.371748 0.089597 0.077577 **** v1 vsl| 1002 BerespProtocol b HTTP/1.1 **** v1 vsl| 1002 BerespStatus b 200 **** v1 vsl| 1002 BerespReason b OK **** v1 vsl| 1002 BerespHeader b xkey: asdf **** v1 vsl| 1002 BerespHeader b Content-Length: 0 **** v1 vsl| 1002 BerespHeader b Date: Mon, 07 Aug 2023 15:37:23 GMT **** v1 vsl| 1002 TTL b RFC 120 10 0 1691422643 1691422643 1691422643 0 0 cacheable **** v1 vsl| 1002 VCL_call b BACKEND_RESPONSE **** v1 vsl| 1002 TTL b VCL 60 10 0 1691422643 cacheable **** v1 vsl| 1002 TTL b VCL 60 0 0 1691422643 cacheable **** v1 vsl| 1002 TTL b VCL 60 0 0 1691422643 cacheable **** v1 vsl| 1002 VCL_return b deliver **** v1 vsl| 1002 Timestamp b Process: 1691422643.385062 0.102911 0.013314 **** v1 vsl| 1002 Filters b **** v1 vsl| 1002 Storage b malloc s0 **** v1 vsl| 1002 Fetch_Body b 0 none - **** v1 vsl| 1002 BackendClose b 25 s1 recycle **** v1 vsl| 1002 Timestamp b BerespBody: 1691422643.406603 0.124452 0.021541 **** v1 vsl| 1002 Length b 0 **** v1 vsl| 1002 BereqAcct b 130 0 130 50 0 50 **** dT 26.059 **** v1 vsl| 1002 End b **** v1 vsl| 1001 Begin c req 1000 rxreq **** v1 vsl| 1001 Timestamp c Start: 1691422643.260815 0.000000 0.000000 **** v1 vsl| 1001 Timestamp c Req: 1691422643.260815 0.000000 0.000000 **** v1 vsl| 1001 VCL_use c vcl1 **** v1 vsl| 1001 ReqStart c 127.0.0.1 42538 a0 **** v1 vsl| 1001 ReqMethod c GET **** v1 vsl| 1001 ReqURL c / **** v1 vsl| 1001 ReqProtocol c HTTP/1.1 **** v1 vsl| 1001 ReqHeader c Host: 127.0.0.1 **** v1 vsl| 1001 ReqHeader c X-Forwarded-For: 127.0.0.1 **** v1 vsl| 1001 ReqHeader c Via: 1.1 v1 (Varnish/7.2) **** v1 vsl| 1001 VCL_call c RECV **** v1 vsl| 1001 VCL_return c hash **** v1 vsl| 1001 VCL_call c HASH **** v1 vsl| 1001 VCL_return c lookup **** v1 vsl| 1001 VCL_call c MISS **** v1 vsl| 1001 VCL_return c fetch **** v1 vsl| 1001 Link c bereq 1002 fetch **** v1 vsl| 1001 Timestamp c Fetch: 1691422643.406818 0.146003 0.146003 **** v1 vsl| 1001 RespProtocol c HTTP/1.1 **** v1 vsl| 1001 RespStatus c 200 **** v1 vsl| 1001 RespReason c OK **** v1 vsl| 1001 RespHeader c xkey: asdf **** v1 vsl| 1001 RespHeader c Content-Length: 0 **** v1 vsl| 1001 RespHeader c Date: Mon, 07 Aug 2023 15:37:23 GMT **** v1 vsl| 1001 RespHeader c X-Varnish: 1001 **** v1 vsl| 1001 RespHeader c Age: 0 **** v1 vsl| 1001 RespHeader c Via: 1.1 v1 (Varnish/7.2) **** v1 vsl| 1001 RespHeader c Accept-Ranges: bytes **** v1 vsl| 1001 VCL_call c DELIVER **** v1 vsl| 1001 VCL_return c deliver **** v1 vsl| 1001 Timestamp c Process: 1691422643.409179 0.148364 0.002360 **** v1 vsl| 1001 Filters c **** v1 vsl| 1001 RespHeader c Connection: keep-alive **** v1 vsl| 1001 Timestamp c Resp: 1691422643.411982 0.151166 0.002802 **** v1 vsl| 1001 ReqAcct c 35 0 35 185 0 185 **** v1 vsl| 1001 End c **** dT 26.067 **** c1 rxhdr|HTTP/1.1 200 OK\r **** c1 rxhdr|xkey: asdf\r **** c1 rxhdr|Content-Length: 0\r **** c1 rxhdr|Date: Mon, 07 Aug 2023 15:37:23 GMT\r **** c1 rxhdr|X-Varnish: 1001\r **** c1 rxhdr|Age: 0\r **** c1 rxhdr|Via: 1.1 v1 (Varnish/7.2)\r **** c1 rxhdr|Accept-Ranges: bytes\r **** c1 rxhdr|Connection: keep-alive\r **** c1 rxhdr|\r **** dT 26.068 **** c1 rxhdrlen = 185 **** c1 http[ 0] |HTTP/1.1 **** c1 http[ 1] |200 **** c1 http[ 2] |OK **** c1 http[ 3] |xkey: asdf **** c1 http[ 4] |Content-Length: 0 **** c1 http[ 5] |Date: Mon, 07 Aug 2023 15:37:23 GMT **** c1 http[ 6] |X-Varnish: 1001 **** c1 http[ 7] |Age: 0 **** c1 http[ 8] |Via: 1.1 v1 (Varnish/7.2) **** c1 http[ 9] |Accept-Ranges: bytes **** c1 http[10] |Connection: keep-alive **** c1 bodylen = 0 **** dT 26.070 *** c1 closing fd 16 **** dT 26.071 ** c1 Ending **** dT 26.073 ** top === varnish v1 -expect XKEY.g_keys == 1 **** dT 26.135 ** v1 as expected: XKEY.g_keys (1) == 1 (1) ** top === varnish v1 -vcl+backend { **** dT 26.137 **** v1 CLI TX|vcl.inline vcl2 << %XJEIFLH|)Xspa8P **** v1 CLI TX|vcl 4.1; **** v1 CLI TX|backend s1 { .host = "127.0.0.1"; .port = "43809"; } **** v1 CLI TX| **** v1 CLI TX| **** v1 CLI TX|\timport xkey from "/builddir/build/BUILD/varnish-modules-0.21.0/src/.libs/libvmod_xkey.so"; **** v1 CLI TX| **** v1 CLI TX|%XJEIFLH|)Xspa8P **** dT 26.161 **** v1 vsl| 1000 SessClose c REM_CLOSE 0.212 **** v1 vsl| 1000 End c **** dT 45.534 *** v1 CLI RX 200 **** v1 CLI TX|vcl.use vcl2 **** dT 45.540 *** v1 CLI RX 200 **** v1 CLI RX|VCL 'vcl2' now active ** top === varnish v1 -vcl+backend "" **** v1 CLI TX|vcl.inline vcl3 << %XJEIFLH|)Xspa8P **** v1 CLI TX|vcl 4.1; **** v1 CLI TX|backend s1 { .host = "127.0.0.1"; .port = "43809"; } **** v1 CLI TX| **** v1 CLI TX| **** v1 CLI TX|%XJEIFLH|)Xspa8P **** dT 45.582 **** v1 vsl| 0 CLI - Rd vcl.load vcl2 vcl_vcl2.1691422643.530321/vgc.so 1auto **** v1 vsl| 0 CLI - Wr 200 52 Loaded "vcl_vcl2.1691422643.530321/vgc.so" as "vcl2" **** v1 vsl| 0 CLI - Rd ping **** v1 vsl| 0 CLI - Wr 200 19 PONG 1691422662 1.0 **** v1 vsl| 0 CLI - Rd vcl.use vcl2 **** v1 vsl| 0 CLI - Wr 200 0 # top TEST ./tests/xkey/test11.vtc TIMED OUT (kill -9) # top TEST ./tests/xkey/test11.vtc FAILED (60.111) signal=9 FAIL tests/xkey/test11.vtc (exit status: 2) ============================================================================ Testsuite summary for varnish-modules 0.21.0 ============================================================================ # TOTAL: 56 # PASS: 54 # SKIP: 0 # XFAIL: 0 # FAIL: 2 # XPASS: 0 # ERROR: 0 ============================================================================ See src/test-suite.log ============================================================================ make[3]: Leaving directory '/builddir/build/BUILD/varnish-modules-0.21.0/src' RPM build errors: make[3]: *** [Makefile:1063: test-suite.log] Error 1 make[2]: *** [Makefile:1171: check-TESTS] Error 2 make[1]: *** [Makefile:1236: check-am] Error 2 make: *** [Makefile:543: check-recursive] Error 1 error: Bad exit status from /var/tmp/rpm-tmp.TbH68Z (%check) Bad exit status from /var/tmp/rpm-tmp.TbH68Z (%check) Child return code was: 1 EXCEPTION: [Error('Command failed: \n # bash --login -c /usr/bin/rpmbuild -bb --noclean --target riscv64 --nodeps /builddir/build/SPECS/varnish-modules.spec\n', 1)] Traceback (most recent call last): File "/usr/lib/python3.11/site-packages/mockbuild/trace_decorator.py", line 93, in trace result = func(*args, **kw) ^^^^^^^^^^^^^^^^^ File "/usr/lib/python3.11/site-packages/mockbuild/util.py", line 598, in do_with_status raise exception.Error("Command failed: \n # %s\n%s" % (command, output), child.returncode) mockbuild.exception.Error: Command failed: # bash --login -c /usr/bin/rpmbuild -bb --noclean --target riscv64 --nodeps /builddir/build/SPECS/varnish-modules.spec